{"text_format":"1","workbook":"xlsx","n_sheets":61,"sheets":["START","Instructions","Template names","Lookup and lists","Org structure","Contacts","A1-Sum","A2-FinPerf SC","A2A","A3-FinPerf V","A3A","A4-FinPerf RE","A5-Capex","A5A","A6-FinPos","A7-CFlow","A8-ResRecon","A9-Asset","A10-SerDel","SA1","SA2","SA3","SA4","SA5","SA6","SA7","SA8","SA9","SA10","SA11","SA12a","SA12b","SA13a","SA13b","SA14","SA15","SA16","SA17","SA18","SA19","SA20","SA21","SA22","SA23","SA24","SA25","SA26","SA27","SA28","SA29","SA30","SA31","SA32","SA33","SA34a","SA34b","SA34c","SA34d","SA35","SA36","SA37"],"not_rendered":{"charts":0,"images":17,"macros":1,"external_links":3,"defined_names":1573,"comments":2,"pivot_tables":0},"unopened":[],"bounds":{"document_bytes":16777216,"sheet_cells":100000,"rows_first":2000,"rows_last":500,"rows_between":2000,"halvings":0,"cell_chars":16384,"cell_head_chars":4096},"cells_cut":0,"cells_raw":0,"read":"whole","date_system":"1900"}

{"sheet":"START","index":0,"n_rows":0,"n_cols":0,"rows_kept":0,"cut":false,"hidden":false,"merged":[]}

{"sheet":"Instructions","index":1,"n_rows":36,"n_cols":24,"rows_kept":36,"cut":false,"hidden":false,"merged":[]}
[]
[null,null,null,2020]
[]
[null,null,null,null,null,null,null,null,null,null,null,null,null,null,null,null,null,null,null,null,null,null,null,"Yes"]
[null,null,null,null,null,null,null,null,null,null,null,null,null,null,null,null,null,null,null,null,null,null,null,"No"]
[]
[null,null,null,null,null,null,null,null,null,null,null,null,null,null,null,null,null,null,null,null,null,null,"Type of Entities Range:"]
[null,null,null,null,null,null,null,null,null,null,null,null,null,null,null,null,null,null,null,null,null,null,null,"Parent Municipality"]
[null,null,null,null,null,null,null,null,null,null,null,null,null,null,null,null,null,null,null,null,null,null,null,"Consolidated Information"]
[]
[]
[]
[]
[]
[]
[]
[null,null,null,null,null,null,null,null,null,null,null,null,null,null,null,null,null,null,null,null,null,null,"MTREF Range:",2008]
[null,null,null,null,null,null,null,null,null,null,null,null,null,null,null,null,null,null,null,null,null,null,null,2009]
[null,null,null,null,null,null,null,null,null,null,null,null,null,null,null,null,null,null,null,null,null,null,null,2010]
[null,null,null,null,null,null,null,null,null,null,null,null,null,null,null,null,null,null,null,null,null,null,null,2011]
[null,null,null,null,null,null,null,null,null,null,null,null,null,null,null,null,null,null,null,null,null,null,null,2012]
[null,null,null,null,null,null,null,null,null,null,null,null,null,null,null,null,null,null,null,null,null,null,null,2013]
[null,null,null,null,null,null,null,null,null,null,null,null,null,null,null,null,null,null,null,null,null,null,null,2014]
[null,null,null,null,null,null,null,null,null,null,null,null,null,null,null,null,null,null,null,null,null,null,null,2015]
[null,null,null,null,null,null,null,null,null,null,null,null,null,null,null,null,null,null,null,null,null,null,null,2016]
[null,null,null,null,null,null,null,null,null,null,null,null,null,null,null,null,null,null,null,null,null,null,null,2017]
[null,null,null,null,null,null,null,null,null,null,null,null,null,null,null,null,null,null,null,null,null,null,null,2018]
[null,null,null,null,null,null,null,null,null,null,null,null,null,null,null,null,null,null,null,null,null,null,null,2019]
[null,null,null,null,null,null,null,null,null,null,null,null,null,null,null,null,null,null,null,null,null,null,null,2020]
[null,null,null,null,null,null,null,null,null,null,null,null,null,null,null,null,null,null,null,null,null,null,null,2021]
[null,null,null,null,null,null,null,null,null,null,null,null,null,null,null,null,null,null,null,null,null,null,null,2022]
[]
[null,null,null,null,null,null,null,null,null,null,null,null,null,null,null,null,null,null,null,null,null,null,"MTREF Linked:",10]
[null,null,null,null,null,null,null,null,null,null,null,null,null,null,null,null,null,null,null,null,null,null,"MTREF:",{"$f":"INDEX(X17:X31,X33,1)","v":2017}]
[]
[null,null,null,null,null,null,null,null,null,null,null,null,null,null,null,null,null,null,null,null,null,null,"Fin Year:",{"$f":"MTREF&\"/\"&RIGHT(MTREF,2)+1","v":"2017/18"}]

{"sheet":"Template names","index":2,"n_rows":177,"n_cols":6,"rows_kept":177,"cut":false,"hidden":true,"merged":[[0,0,0,3],[86,0,86,1],[109,0,109,1],[98,0,98,1],[91,0,91,3]]}
["Common sheet headings"]
["Head1",{"$f":"HLOOKUP(MTREF,Headings,2)","v":"2015/16"},"Prior year -1"]
["Head1A",{"$f":"HLOOKUP(MTREF,Headings,3)","v":"2014/15"},"Prior year -2"]
["Head1B",{"$f":"HLOOKUP(MTREF,Headings,4)","v":"2013/14"},"Prior year -3"]
["Head2",{"$f":"HLOOKUP(MTREF,Headings,5)","v":"Current Year 2016/17"},"Year in which budget is being prepared"]
["Head2A",{"$f":"HLOOKUP(MTREF,Headings,6)","v":"2016/17"},"Year in which budget is being prepared"]
["Head3",{"$f":"HLOOKUP(MTREF,Headings,7)","v":"2017/18 Medium Term Revenue & Expenditure Framework"},"MTREF name"]
["Head4","LTFS","Long term financial strategy"]
["Head5","Audited Outcome"]
["Head5A","Outcome"]
["Head5B","Pre-audit outcome"]
["Head6","Original Budget"]
["Head7","Adjusted Budget"]
["Head8","Full Year Forecast"]
["Head9",{"$f":"HLOOKUP(MTREF,Headings,8)","v":"Budget Year 2017/18"},"1st year of MTREF","Year1"]
["Head10",{"$f":"HLOOKUP(MTREF,Headings,9)","v":"Budget Year +1 2018/19"},"2nd year of MTREF","Year2"]
["Head11",{"$f":"HLOOKUP(MTREF,Headings,10)","v":"Budget Year +2 2019/20"},"3rd year of MTREF","Year3"]
["Head12",{"$f":"HLOOKUP(MTREF,Headings,11)","v":"Forecast 2020/21"},"1st yr of long term forecast","Year4"]
["Head13",{"$f":"HLOOKUP(MTREF,Headings,12)","v":"Forecast 2021/22"},"Next yr of long term forecast","Year5"]
["Head14",{"$f":"HLOOKUP(MTREF,Headings,13)","v":"Forecast 2022/23"},"Next yr of long term forecast","Year6"]
["Head15",{"$f":"HLOOKUP(MTREF,Headings,14)","v":"Forecast 2023/24"},"Next yr of long term forecast","Year7"]
["Head16",{"$f":"HLOOKUP(MTREF,Headings,15)","v":"Forecast 2024/25"},"Next yr of long term forecast","Year8"]
["Head17",{"$f":"HLOOKUP(MTREF,Headings,16)","v":"Forecast 2025/26"},"Next yr of long term forecast","Year9"]
["Head18",{"$f":"HLOOKUP(MTREF,Headings,17)","v":"Forecast 2026/27"},"Next yr of long term forecast","Year10"]
["Head19",{"$f":"HLOOKUP(MTREF,Headings,18)","v":"Forecast 2027/28"},"Next yr of long term forecast","Year11"]
["Head20",{"$f":"HLOOKUP(MTREF,Headings,19)","v":"Forecast 2028/29"},"Next yr of long term forecast","Year12"]
["Head21",{"$f":"HLOOKUP(MTREF,Headings,20)","v":"Forecast 2029/30"},"Next yr of long term forecast","Year13"]
["Head22",{"$f":"HLOOKUP(MTREF,Headings,21)","v":"Forecast 2030/31"},"Next yr of long term forecast","Year14"]
["Head23",{"$f":"HLOOKUP(MTREF,Headings,22)","v":"Forecast 2031/32"},"Next yr of long term forecast","Year15"]
["Head24","Description"]
["Head25"]
["Head26","Vote Description"]
["Head27","Ref"]
["Head27a","References"]
["Head28","Surplus/(Deficit) for the year",null,"Result"]
["Head29",{"$f":"HLOOKUP(MTREF,Headings,23)","v":"Annual target 2017/18"}]
["Head30",{"$f":"HLOOKUP(MTREF,Headings,24)","v":"Revised target 2017/18"}]
["Head31","Quarter ended 30 September"]
["Head32","Quarter ended 31 December"]
["Head33","Quarter ended 31 March"]
["Head34","Quarter ended 30 June"]
["Head35","Variance explanation"]
["Head36","YTD  Actual 31 Dec"]
["Head37","YTD  Budget 31 Dec"]
["Head38","Monthly actual"]
["Head39","YTD actual"]
["Head40","YTD budget"]
["Head41","YTD variance"]
["Head42","Surplus/ (Deficit) for the yr/period"]
["Head43",{"$f":"Head3&\" Summary\"","v":"2017/18 Medium Term Revenue & Expenditure Framework Summary"}]
["Head44","2001 Census"]
["Head45","2011 Census"]
["Head46"," - Adjustments Budget - January 2007"]
["Head47","Previous target year to complete"]
["Head48","Present value"]
["Head49"]
["Head50","Other Adjusts."]
["Head51","Accum. Funds"]
["Head52","Multi-year capital"]
["Head53","Unfore. Unavoid."]
["Head54","Prior Adjusted"]
["Head55","Nat. or Prov. Govt"]
["Head56","Total Adjusts."]
["SFPerf1","Budgeted Financial Performance"]
["SFPerf2","Forecast Financial Performance"]
["SFPos1","Budgeted Financial Position"]
["SFPos2","Forecast Financial Position"]
["Cash1","Budget Cash Flow"]
["Cash2","Forecast Cash Flow"]
["RandM","Expenditure includes repairs & maintenance of R'000"]
["Depart1","Department 1 - ",null,"DEP1"]
["Depart2","Department 2 - ",null,"DEP2"]
["Depart3","Department 3 - ",null,"DEP3"]
["Depart4","Department 4 - ",null,"DEP4"]
["Depart5","Department 5 - ",null,"DEP5"]
["Depart6","Department 6 - ",null,"DEP6"]
["Depart7","Department 7 - ",null,"DEP7"]
["Depart8","Department 8 - ",null,"DEP8"]
["Depart9","Department 9 - ",null,"DEP9"]
["Depart10","Department 10 - ",null,"DEP10"]
["Depart11","Department 11 - ",null,"DEP11"]
["Depart12","Department 12 - ",null,"DEP12"]
["Depart13","Department 13 - ",null,"DEP13"]
["Depart14","Department 14 - ",null,"DEP14"]
[]
[]
["Base year of forecast column selection names"]
["Choose","ACT"]
[null,"APP"]
[null,"ADJ"]
[]
["Standard nomenclature"]
["Muni",{"$f":"'Lookup and lists'!B28","v":"FS205 Mafube"}]
["Municipal Entities",2,"Type of report:",1]
[{"$f":"IF((MuniEntities=1)*(MuniType=2),\"YES\",\"NO\")","v":"NO"},"Does this municipality have entities (consolidated budget and entity budgets required)? YES/NO"]
["Entity 1","(Pty) Ltd Example 1 - Municipal entity - ",null,"Ent1"]
["Entity 2","(Pty) Ltd Example 2 - Municipal entity - ",null,"Ent2"]
["Entity 3","Municipal Entity Example 3",null,"Ent3"]
["Budget approval tables",null,"Chart x-ref","Sch/Tab/Ch","Alternative for municipalities without entities","Alternative for municipalities without entities"]
[null,{"$f":"IF(Consolques=\"YES\",E100,F100)","v":"Table A1 Budget Summary"},null,"Table A1 ",{"$f":"D100&\"Consolidated Budget Summary\"","v":"Table A1 Consolidated Budget Summary"},{"$f":"D100&\"Budget Summary\"","v":"Table A1 Budget Summary"}]
[null,"Table A2 Budgeted Financial Performance (revenue and expenditure by standard classification)","Charts 5, 6","Table A2 ",{"$f":"D101&\"Consolidated Budgeted Financial Performance (revenue and expenditure by standard classification)\"","v":"Table A2 Consolidated Budgeted Financial Performance (revenue and expenditure by standard classification)"},{"$f":"D101&\"Budgeted Financial Performance (revenue and expenditure by standard classification)\"","v":"Table A2 Budgeted Financial Performance (revenue and expenditure by standard classification)"}]
[null,"Table A3 Budgeted Financial Performance (revenue and expenditure by municipal vote)",null,"Table A3 ",{"$f":"D102&\"Consolidated Budgeted Financial Performance (revenue and expenditure by municipal vote)\"","v":"Table A3 Consolidated Budgeted Financial Performance (revenue and expenditure by municipal vote)"},{"$f":"D102&\"Budgeted Financial Performance (revenue and expenditure by municipal vote)\"","v":"Table A3 Budgeted Financial Performance (revenue and expenditure by municipal vote)"}]
[null,"Table A4 Budgeted Financial Performance (revenue and expenditure)","Charts 1, 2, 3, 4","Table A4 ",{"$f":"D103&\"Consolidated Budgeted Financial Performance (revenue and expenditure)\"","v":"Table A4 Consolidated Budgeted Financial Performance (revenue and expenditure)"},{"$f":"D103&\"Budgeted Financial Performance (revenue and expenditure)\"","v":"Table A4 Budgeted Financial Performance (revenue and expenditure)"}]
[null,"Table A5 Budgeted Capital Expenditure by vote, standard classification and funding","Charts 7, 8, 9, 10, 20","Table A5 ",{"$f":"D104&\"Consolidated Budgeted Capital Expenditure by vote, standard classification and funding\"","v":"Table A5 Consolidated Budgeted Capital Expenditure by vote, standard classification and funding"},{"$f":"D104&\"Budgeted Capital Expenditure by vote, standard classification and funding\"","v":"Table A5 Budgeted Capital Expenditure by vote, standard classification and funding"}]
[null,"Table A6 Budgeted Financial Position",null,"Table A6 ",{"$f":"D105&\"Consolidated Budgeted Financial Position\"","v":"Table A6 Consolidated Budgeted Financial Position"},{"$f":"D105&\"Budgeted Financial Position\"","v":"Table A6 Budgeted Financial Position"}]
[null,"Table A7 Budgeted Cash Flows",null,"Table A7 ",{"$f":"D106&\"Consolidated Budgeted Cash Flows\"","v":"Table A7 Consolidated Budgeted Cash Flows"},{"$f":"D106&\"Budgeted Cash Flows\"","v":"Table A7 Budgeted Cash Flows"}]
[null,"Table A8 Cash backed reserves/accumulated surplus reconciliation",null,"Table A8 ",{"$f":"D107&\"Consolidated Cash backed reserves/accumulated surplus reconciliation\"","v":"Table A8 Consolidated Cash backed reserves/accumulated surplus reconciliation"},{"$f":"D107&\"Cash backed reserves/accumulated surplus reconciliation\"","v":"Table A8 Cash backed reserves/accumulated surplus reconciliation"}]
[null,"Table A9 Asset Management",null,"Table A9 ",{"$f":"D108&\"Consolidated Asset Management\"","v":"Table A9 Consolidated Asset Management"},{"$f":"D108&\"Asset Management\"","v":"Table A9 Asset Management"}]
[null,"Table A10 Basic service delivery measurement",null,"Table A10 ",{"$f":"D109&\"Consolidated basic service delivery measurement\"","v":"Table A10 Consolidated basic service delivery measurement"},{"$f":"D109&\"Basic service delivery measurement\"","v":"Table A10 Basic service delivery measurement"}]
["Supportinging Tables to the Budget Approval Tables",null,{"$f":"$C$99","v":"Chart x-ref"},{"$f":"$D$99","v":"Sch/Tab/Ch"}]
["Supporting Table SA1",{"$f":"A111&\" Supportinging detail to 'Budgeted Financial Performance'\"","v":"Supporting Table SA1 Supportinging detail to 'Budgeted Financial Performance'"}]
["Supporting Table SA2 ",{"$f":"IF(Consolques=\"YES\",E112,F112)","v":"Supporting Table SA2 Matrix Financial Performance Budget (revenue source/expenditure type and dept.)"},null,null,{"$f":"A112&\"Consolidated Matrix Financial Performance Budget (revenue source/expenditure type & dept.)\"","v":"Supporting Table SA2 Consolidated Matrix Financial Performance Budget (revenue source/expenditure type & dept.)"},{"$f":"A112&\"Matrix Financial Performance Budget (revenue source/expenditure type and dept.)\"","v":"Supporting Table SA2 Matrix Financial Performance Budget (revenue source/expenditure type and dept.)"}]
["Supporting Table SA3 ",{"$f":"A113&\"Supportinging detail to 'Budgeted Financial Position'\"","v":"Supporting Table SA3 Supportinging detail to 'Budgeted Financial Position'"}]
["Supporting Table SA4 ",{"$f":"A114&\"Reconciliation of IDP strategic objectives and budget (revenue)\"","v":"Supporting Table SA4 Reconciliation of IDP strategic objectives and budget (revenue)"},"Chart 11"]
["Supporting Table SA5 ",{"$f":"A115&\"Reconciliation of IDP strategic objectives and budget (operating expenditure)\"","v":"Supporting Table SA5 Reconciliation of IDP strategic objectives and budget (operating expenditure)"},"Chart 12"]
["Supporting Table SA6 ",{"$f":"A116&\"Reconciliation of IDP strategic objectives and budget (capital expenditure)\"","v":"Supporting Table SA6 Reconciliation of IDP strategic objectives and budget (capital expenditure)"},"Chart 13"]
["Supporting Table SA7",{"$f":"A117&\" Measureable performance objectives\"","v":"Supporting Table SA7 Measureable performance objectives"}]
["Supporting Table SA8",{"$f":"A118&\" Performance indicators and benchmarks\"","v":"Supporting Table SA8 Performance indicators and benchmarks"},"Chts 15-19"]
["Supporting Table SA9",{"$f":"A119&\" Social, economic and demographic statistics and assumptions\"","v":"Supporting Table SA9 Social, economic and demographic statistics and assumptions"}]
["Supporting Table SA10",{"$f":"A120&\" Funding measurement\"","v":"Supporting Table SA10 Funding measurement"},"Chart 14"]
["Supporting Table SA11",{"$f":"A121&\" Property rates summary\"","v":"Supporting Table SA11 Property rates summary"}]
["Supporting Table SA12a",{"$f":"A122&\" Property rates by category (current year)\"","v":"Supporting Table SA12a Property rates by category (current year)"}]
["Supporting Table SA12b",{"$f":"A123&\" Property rates by category (budget year)\"","v":"Supporting Table SA12b Property rates by category (budget year)"}]
["Supporting Table SA13a",{"$f":"A124&\" Service Tariffs by category\"","v":"Supporting Table SA13a Service Tariffs by category"}]
["Supporting Table SA13b",{"$f":"A125&\" Service Tariffs by category - explanatory\"","v":"Supporting Table SA13b Service Tariffs by category - explanatory"}]
["Supporting Table SA14",{"$f":"A126&\" Household bills\"","v":"Supporting Table SA14 Household bills"}]
["Supporting Table SA15",{"$f":"A127&\" Investment particulars by type\"","v":"Supporting Table SA15 Investment particulars by type"}]
["Supporting Table SA16",{"$f":"A128&\" Investment particulars by maturity\"","v":"Supporting Table SA16 Investment particulars by maturity"}]
["Supporting Table SA17",{"$f":"A129&\" Borrowing\"","v":"Supporting Table SA17 Borrowing"}]
["Supporting Table SA18",{"$f":"A130&\" Transfers and grant receipts\"","v":"Supporting Table SA18 Transfers and grant receipts"}]
["Supporting Table SA19",{"$f":"A131&\" Expenditure on transfers and grant programme\"","v":"Supporting Table SA19 Expenditure on transfers and grant programme"}]
["Supporting Table SA20",{"$f":"A132&\" Reconciliation of transfers, grant receipts and unspent funds\"","v":"Supporting Table SA20 Reconciliation of transfers, grant receipts and unspent funds"}]
["Supporting Table SA21",{"$f":"A133&\" Transfers and grants made by the municipality\"","v":"Supporting Table SA21 Transfers and grants made by the municipality"}]
["Supporting Table SA22",{"$f":"A134&\" Summary councillor and staff benefits\"","v":"Supporting Table SA22 Summary councillor and staff benefits"}]
["Supporting Table SA23",{"$f":"A135&\" Salaries, allowances & benefits (political office bearers/councillors/senior managers)\"","v":"Supporting Table SA23 Salaries, allowances & benefits (political office bearers/councillors/senior managers)"}]
["Supporting Table SA24",{"$f":"A136&\" Summary of personnel numbers\"","v":"Supporting Table SA24 Summary of personnel numbers"}]
["Supporting Table SA25",{"$f":"IF(Consolques=\"YES\",E137,F137)","v":"Supporting Table SA25 Budgeted monthly revenue and expenditure"},null,null,{"$f":"A137&\" Consolidated budgeted monthly revenue and expenditure\"","v":"Supporting Table SA25 Consolidated budgeted monthly revenue and expenditure"},{"$f":"A137&\" Budgeted monthly revenue and expenditure\"","v":"Supporting Table SA25 Budgeted monthly revenue and expenditure"}]
["Supporting Table SA26","Supporting Table SA26 Budgeted monthly revenue and expenditure (municipal vote)",null,null,{"$f":"A138&\" Consolidated budgeted monthly revenue and expenditure (municipal vote)\"","v":"Supporting Table SA26 Consolidated budgeted monthly revenue and expenditure (municipal vote)"},{"$f":"A138&\" Budgeted monthly revenue and expenditure (municipal vote)\"","v":"Supporting Table SA26 Budgeted monthly revenue and expenditure (municipal vote)"}]
["Supporting Table SA27","Supporting Table SA27 Budgeted monthly revenue and expenditure (standard classification)",null,null,{"$f":"A139&\" Consolidated budgeted monthly revenue and expenditure (standard classification)\"","v":"Supporting Table SA27 Consolidated budgeted monthly revenue and expenditure (standard classification)"},{"$f":"A139&\" Budgeted monthly revenue and expenditure (standard classification)\"","v":"Supporting Table SA27 Budgeted monthly revenue and expenditure (standard classification)"}]
["Supporting Table SA28","Supporting Table SA28 Budgeted monthly capital expenditure (municipal vote)",null,null,{"$f":"A140&\" Consolidated budgeted monthly capital expenditure (municipal vote)\"","v":"Supporting Table SA28 Consolidated budgeted monthly capital expenditure (municipal vote)"},{"$f":"A140&\" Budgeted monthly capital expenditure (municipal vote)\"","v":"Supporting Table SA28 Budgeted monthly capital expenditure (municipal vote)"}]
["Supporting Table SA29","Supporting Table SA29 Budgeted monthly capital expenditure (standard classification)",null,null,{"$f":"A141&\" Consolidated budgeted monthly capital expenditure (standard classification)\"","v":"Supporting Table SA29 Consolidated budgeted monthly capital expenditure (standard classification)"},{"$f":"A141&\" Budgeted monthly capital expenditure (standard classification)\"","v":"Supporting Table SA29 Budgeted monthly capital expenditure (standard classification)"}]
["Supporting Table SA30","Supporting Table SA30 Budgeted monthly cash flow",null,null,{"$f":"A142&\" Consolidated budgeted monthly cash flow\"","v":"Supporting Table SA30 Consolidated budgeted monthly cash flow"},{"$f":"A142&\" Budgeted monthly cash flow\"","v":"Supporting Table SA30 Budgeted monthly cash flow"}]
["Supporting Table SA31","NOT REQUIRED - municipality does not have entities",null,null,{"$f":"A143&\" Aggregated entity budget\"","v":"Supporting Table SA31 Aggregated entity budget"},"NOT REQUIRED - municipality does not have entities"]
["Supporting Table SA32",{"$f":"A144&\" List of external mechanisms\"","v":"Supporting Table SA32 List of external mechanisms"}]
["Supporting Table SA33",{"$f":"A145&\" Contracts having future budgetary implications\"","v":"Supporting Table SA33 Contracts having future budgetary implications"}]
["Supporting Table SA34a",{"$f":"IF(Consolques=\"YES\",E146,F146)","v":"Supporting Table SA34a Capital expenditure on new assets by asset class"},null,null,{"$f":"A146&\" Consolidated capital expenditure on new assets by asset class\"","v":"Supporting Table SA34a Consolidated capital expenditure on new assets by asset class"},{"$f":"A146&\" Capital expenditure on new assets by asset class\"","v":"Supporting Table SA34a Capital expenditure on new assets by asset class"}]
["Supporting Table SA34b","Supporting Table SA34b Capital expenditure on the renewal of existing assets by asset class",null,null,{"$f":"A147&\" Consolidated capital expenditure on existing assets by asset class\"","v":"Supporting Table SA34b Consolidated capital expenditure on existing assets by asset class"},{"$f":"A147&\" Capital expenditure on the renewal of existing assets by asset class\"","v":"Supporting Table SA34b Capital expenditure on the renewal of existing assets by asset class"}]
["Supporting Table SA34c","Supporting Table SA34c Repairs and maintenance expenditure by asset class",null,null,{"$f":"A148&\" Consolidated repairs and maintenance by asset class\"","v":"Supporting Table SA34c Consolidated repairs and maintenance by asset class"},{"$f":"A148&\" Repairs and maintenance expenditure by asset class\"","v":"Supporting Table SA34c Repairs and maintenance expenditure by asset class"}]
["Supporting Table SA34d",{"$f":"IF(Consolques=\"YES\",E149,F149)","v":"Supporting Table SA34d Depreciation by asset class"},null,null,{"$f":"A149&\" Consolidated Depreciation by asset class\"","v":"Supporting Table SA34d Consolidated Depreciation by asset class"},{"$f":"A149&\" Depreciation by asset class\"","v":"Supporting Table SA34d Depreciation by asset class"}]
["Supporting Table SA35","Supporting Table SA35 Future financial implications of the capital budget",null,null,{"$f":"A150&\" Consolidated future financial implications of the capital budget\"","v":"Supporting Table SA35 Consolidated future financial implications of the capital budget"},{"$f":"A150& \" Future financial implications of the capital budget\"","v":"Supporting Table SA35 Future financial implications of the capital budget"}]
["Supporting Table SA36","Supporting Table SA36 Detailed capital budget",null,null,{"$f":"A151&\" Consolidated detailed capital budget\"","v":"Supporting Table SA36 Consolidated detailed capital budget"},{"$f":"A151& \" Detailed capital budget\"","v":"Supporting Table SA36 Detailed capital budget"}]
["Supporting Table SA37","Supporting Table SA37 Projects delayed from previous financial year/s",null,null,{"$f":"A152&\" Consolidated projects delayed from previous financial year/s\"","v":"Supporting Table SA37 Consolidated projects delayed from previous financial year/s"},{"$f":"A152& \" Projects delayed from previous financial year/s\"","v":"Supporting Table SA37 Projects delayed from previous financial year/s"}]
[]
["Budget Charts","Charts","Cross reference"]
["Chart A1 ",{"$f":"A155&\"Revenue by Municipal Vote\"","v":"Chart A1 Revenue by Municipal Vote"}]
["Chart A2 ",{"$f":"A156&\"Expenditure by Municipal Vote\"","v":"Chart A2 Expenditure by Municipal Vote"}]
["Chart A3 ",{"$f":"A157&\"Revenue by Standard Classification\"","v":"Chart A3 Revenue by Standard Classification"},"A2"]
["Chart A4 ",{"$f":"A158&\"Expenditure by Standard Classification\"","v":"Chart A4 Expenditure by Standard Classification"},"A2"]
["Chart A5 ",{"$f":"A159&\"Revenue by Major Source (refer 'Minor' source for 'Other Revenue' allocation\"","v":"Chart A5 Revenue by Major Source (refer 'Minor' source for 'Other Revenue' allocation"},"A3"]
["Chart A6 ",{"$f":"A160&\"Revenue by Minor Source (Other)\"","v":"Chart A6 Revenue by Minor Source (Other)"},"A3"]
["Chart A7 ",{"$f":"A161&\"Expenditure by Major Type\"","v":"Chart A7 Expenditure by Major Type"},"A3"]
["Chart A8 ",{"$f":"A162&\"Expenditure by Minor Type (Other)\"","v":"Chart A8 Expenditure by Minor Type (Other)"},"A3"]
["Chart A9 ",{"$f":"A163&\"Capital Expenditure by Municipal Vote/Appropriation (Major)\"","v":"Chart A9 Capital Expenditure by Municipal Vote/Appropriation (Major)"},"A5"]
["Chart A10 ",{"$f":"A164&\"Capital Expenditure by Municipal Vote/Appropriation (Minor)\"","v":"Chart A10 Capital Expenditure by Municipal Vote/Appropriation (Minor)"},"A5"]
["Chart A11 ",{"$f":"A164&\"Capital Expenditure by Standard Classification\"","v":"Chart A10 Capital Expenditure by Standard Classification"},"A5"]
["Chart A12 ",{"$f":"A166&\"Capital expenditure performance trend\"","v":"Chart A12 Capital expenditure performance trend"},"A5"]
["Chart A13 ",{"$f":"A167&\"Capital funding by Source\"","v":"Chart A13 Capital funding by Source"},"A5"]
["Chart A14 ",{"$f":"A168&\"Cash flow trend\"","v":"Chart A14 Cash flow trend"},"A7"]
["Chart A15 ",{"$f":"A169&\"IDP Strategic Objective - Revenue\"","v":"Chart A15 IDP Strategic Objective - Revenue"},"Table A4"]
["Chart A16 ",{"$f":"A170&\"IDP Strategic Objective - Expenditure\"","v":"Chart A16 IDP Strategic Objective - Expenditure"},"Table A5"]
["Chart A17 ",{"$f":"A171&\"IDP Strategic Objective - Capital Expenditure\"","v":"Chart A17 IDP Strategic Objective - Capital Expenditure"},"Table A6"]
["Chart A18 ",{"$f":"A172&\"Debt (borrowing to Total Revenue)\"","v":"Chart A18 Debt (borrowing to Total Revenue)"},"Table A8"]
["Chart A19 ",{"$f":"A173&\"Debtors' trend analysis\"","v":"Chart A19 Debtors' trend analysis"},"Table A8"]
["Chart A20 ",{"$f":"A174&\"Distribution losses\"","v":"Chart A20 Distribution losses"},"Table A8"]
["Chart A21 ",{"$f":"A175&\"Borrowed funding of capital expenditure\"","v":"Chart A21 Borrowed funding of capital expenditure"},"Table A8"]
["Chart A22 ",{"$f":"A176&\"Expenditure analysis (% of Revenue)\"","v":"Chart A22 Expenditure analysis (% of Revenue)"},"Table A8"]
["Chart A23 ",{"$f":"A177&\"Increases in service charges\"","v":"Chart A23 Increases in service charges"},"Table A10"]

{"sheet":"Lookup and lists","index":3,"n_rows":308,"n_cols":29,"rows_kept":308,"cut":false,"hidden":true,"merged":[]}
["Description",2007,2008,2009,2010,2011,2012,2013,2014,2015,2016,2017,2018,2019,2020,null,"Lists",null,null,null,null,null,null,null,"Grants:","National - opex","Provincial - opex","National - capex","Provincial - capex"]
[{"$f":"'Template names'!C2","v":"Prior year -1"},"2005/06","2006/07","2007/08",{"$f":"E1-2&\"/\"&RIGHT(E1,2)-1","v":"2008/9"},"2009/10","2010/11","2011/12","2012/13","2013/14","2014/15","2015/16","2016/17","2017/18","2018/19",null,"Yes","<1","<4","Market","Land & impr.","Yes","Uniform","Yrs",null,"Local Government Equitable Share","Health subsidy"," Municipal Infrastructure Grant (MIG)","Agriculture"]
[{"$f":"'Template names'!C3","v":"Prior year -2"},"2004/05","2005/06","2006/07",{"$f":"E1-3&\"/\"&RIGHT(E1,2)-2","v":"2007/8"},"2008/9","2009/10","2010/11","2011/12","2012/13","2013/14","2014/15","2015/16","2016/17","2017/18",null,"No",1,4,"Dep.Replace","Land only","No","Variable","Mths",null,"RSC Levy Replacement ","Ambulance subsidy"," Public Transport and Systems","Education"]
[{"$f":"'Template names'!C4","v":"Prior year -3"},"2003/04","2004/05","2005/06",{"$f":"E1-4&\"/\"&RIGHT(E1,2)-3","v":"2006/7"},"2007/8","2008/9","2009/10","2010/11","2011/12","2012/13","2013/14","2014/15","2015/16","2016/17",null,null,2,5,"Other","Other",null,null,null,null,"Finance Management ","Housing","Rural Transport Services and Infrastructure","Health"]
[{"$f":"'Template names'!C5","v":"Year in which budget is being prepared"},"Current Year 2006/07","Current Year 2007/08","Current Year 2008/09",{"$f":"\"Current Year \"& E1-1&\"/\"&RIGHT(E1,2)","v":"Current Year 2009/10"},"Current Year 2010/11","Current Year 2011/12","Current Year 2012/13","Current Year 2013/14","Current Year 2014/15","Current Year 2015/16","Current Year 2016/17","Current Year 2017/18","Current Year 2018/19","Current Year 2019/20",null,null,3,6,null,null,null,null,null,null,"Municipal Systems Improvement","Sport and Recreation","Regional Bulk Infrastructure","Housing and Local Government "]
[{"$f":"'Template names'!C6","v":"Year in which budget is being prepared"},"2006/07","2007/08","2008/09",{"$f":"E1-1&\"/\"&RIGHT(E1,2)","v":"2009/10"},"2010/11","2011/12","2012/13","2013/14","2014/15","2015/16","2016/17","2017/18","2018/19","2019/20",null,null,4,"6-10",null,null,null,null,null,null,"Water Services Operating Subsidy ",null,"Rural Households Infrastructure ","Other Departments"]
[{"$f":"'Template names'!C7","v":"MTREF name"},"2007/08 Medium Term Revenue & Expenditure Framework","2008/09 Medium Term Revenue & Expenditure Framework","2009/10 Medium Term Revenue & Expenditure Framework",{"$f":"E1&\"/\"&RIGHT(E1,2)+1&\" Medium Term Revenue & Expenditure Framework\"","v":"2010/11 Medium Term Revenue & Expenditure Framework"},"2011/12 Medium Term Revenue & Expenditure Framework","2012/13 Medium Term Revenue & Expenditure Framework","2013/14 Medium Term Revenue & Expenditure Framework","2014/15 Medium Term Revenue & Expenditure Framework","2015/16 Medium Term Revenue & Expenditure Framework","2016/17 Medium Term Revenue & Expenditure Framework","2017/18 Medium Term Revenue & Expenditure Framework","2018/19 Medium Term Revenue & Expenditure Framework","2019/20 Medium Term Revenue & Expenditure Framework","2020/21 Medium Term Revenue & Expenditure Framework",null,null,5,">10",null,null,null,null,null,null,"Energy Efficiency  and Demand Management",null,"Neighbourhood Development Partnership","Public Works, Roads, Transport "]
[{"$f":"'Template names'!C15","v":"1st year of MTREF"},"Budget Year 2007/08","Budget Year 2008/09","Budget Year 2009/10",{"$f":"\"Budget Year \"&E1&\"/\"&RIGHT(E1,2)+1","v":"Budget Year 2010/11"},"Budget Year 2011/12","Budget Year 2012/13","Budget Year 2013/14","Budget Year 2014/15","Budget Year 2015/16","Budget Year 2016/17","Budget Year 2017/18","Budget Year 2018/19","Budget Year 2019/20","Budget Year 2020/21",null,null,">5",null,null,null,null,null,null,null,"Integrated National Electrification Programme",null,"2010 FIFA World Cup Stadiums Development","Sport and Recreation"]
[{"$f":"'Template names'!C16","v":"2nd year of MTREF"},"Budget Year +1 2008/09","Budget Year +1 2009/10","Budget Year +1 2010/11",{"$f":"\"Budget Year +1 \"&E1+1&\"/\"&RIGHT(E1,2)+2","v":"Budget Year +1 2011/12"},"Budget Year +1 2012/13","Budget Year +1 2013/14","Budget Year +1 2014/15","Budget Year +1 2015/16","Budget Year +1 2016/17","Budget Year +1 2017/18","Budget Year +1 2018/19","Budget Year +1 2019/20","Budget Year +1 2020/21","Budget Year +1 2021/22",null,null,null,null,null,null,null,null,null,null,"Municipal Drought Relief "]
[{"$f":"'Template names'!C17","v":"3rd year of MTREF"},"Budget Year +2 2009/10","Budget Year +2 2010/11","Budget Year +2 2011/12",{"$f":"\"Budget Year +2 \"&E1+2&\"/\"&RIGHT(E1,2)+3","v":"Budget Year +2 2012/13"},"Budget Year +2 2013/14","Budget Year +2 2014/15","Budget Year +2 2015/16","Budget Year +2 2016/17","Budget Year +2 2017/18","Budget Year +2 2018/19","Budget Year +2 2019/20","Budget Year +2 2020/21","Budget Year +2 2021/22","Budget Year +2 2022/23",null,null,null,null,null,null,null,null,null,null,"2010 FIFA World Cup Operating"]
[{"$f":"'Template names'!C18","v":"1st yr of long term forecast"},"Forecast 2010/11","Forecast 2011/12","Forecast 2012/13",{"$f":"\"Forecast \"&E1+3&\"/\"&RIGHT(E1,2)+4","v":"Forecast 2013/14"},"Forecast 2014/15","Forecast 2015/16","Forecast 2016/17","Forecast 2017/18","Forecast 2018/19","Forecast 2019/20","Forecast 2020/21","Forecast 2021/22","Forecast 2022/23","Forecast 2023/24",null,null,null,null,null,null,null,null,null,null,"Electricity Demand Side Management"]
[{"$f":"'Template names'!C19","v":"Next yr of long term forecast"},"Forecast 2011/12","Forecast 2012/13","Forecast 2013/14",{"$f":"\"Forecast \"&E1+4&\"/\"&RIGHT(E1,2)+5","v":"Forecast 2014/15"},"Forecast 2015/16","Forecast 2016/17","Forecast 2017/18","Forecast 2018/19","Forecast 2019/20","Forecast 2020/21","Forecast 2021/22","Forecast 2022/23","Forecast 2023/24","Forecast 2024/25",null,null,null,null,null,null,null,null,null,null,"EPWP Incentive"]
[{"$f":"'Template names'!C20","v":"Next yr of long term forecast"},"Forecast 2012/13","Forecast 2013/14","Forecast 2014/15",{"$f":"\"Forecast \"&E1+5&\"/\"&RIGHT(E1,2)+6","v":"Forecast 2015/16"},"Forecast 2016/17","Forecast 2017/18","Forecast 2018/19","Forecast 2019/20","Forecast 2020/21","Forecast 2021/22","Forecast 2022/23","Forecast 2023/24","Forecast 2024/25","Forecast 2025/26"]
[{"$f":"'Template names'!C21","v":"Next yr of long term forecast"},"Forecast 2013/14","Forecast 2014/15","Forecast 2015/16",{"$f":"\"Forecast \"&E1+6&\"/\"&RIGHT(E1,2)+7","v":"Forecast 2016/17"},"Forecast 2017/18","Forecast 2018/19","Forecast 2019/20","Forecast 2020/21","Forecast 2021/22","Forecast 2022/23","Forecast 2023/24","Forecast 2024/25","Forecast 2025/26","Forecast 2026/27",null,null,null,null,null,null,null,null,null,null,"Asset Class","Asset sub-class"]
[{"$f":"'Template names'!C22","v":"Next yr of long term forecast"},"Forecast 2014/15","Forecast 2015/16","Forecast 2016/17",{"$f":"\"Forecast \"&E1+7&\"/\"&RIGHT(E1,2)+8","v":"Forecast 2017/18"},"Forecast 2018/19","Forecast 2019/20","Forecast 2020/21","Forecast 2021/22","Forecast 2022/23","Forecast 2023/24","Forecast 2024/25","Forecast 2025/26","Forecast 2026/27","Forecast 2027/28"]
[{"$f":"'Template names'!C23","v":"Next yr of long term forecast"},"Forecast 2015/16","Forecast 2016/17","Forecast 2017/18",{"$f":"\"Forecast \"&E1+8&\"/\"&RIGHT(E1,2)+9","v":"Forecast 2018/19"},"Forecast 2019/20","Forecast 2020/21","Forecast 2021/22","Forecast 2022/23","Forecast 2023/24","Forecast 2024/25","Forecast 2025/26","Forecast 2026/27","Forecast 2027/28","Forecast 2028/29",null,null,null,null,null,null,null,null,null,null,"Infrastructure - Road transport","Roads, Pavements & Bridges"]
[{"$f":"'Template names'!C24","v":"Next yr of long term forecast"},"Forecast 2016/17","Forecast 2017/18","Forecast 2018/19",{"$f":"\"Forecast \"&E1+9&\"/\"&RIGHT(E1,2)+10","v":"Forecast 2019/20"},"Forecast 2020/21","Forecast 2021/22","Forecast 2022/23","Forecast 2023/24","Forecast 2024/25","Forecast 2025/26","Forecast 2026/27","Forecast 2027/28","Forecast 2028/29","Forecast 2029/30",null,null,null,null,null,null,null,null,null,null,"Infrastructure - Electricity","Storm water"]
[{"$f":"'Template names'!C25","v":"Next yr of long term forecast"},"Forecast 2017/18","Forecast 2018/19","Forecast 2019/20",{"$f":"\"Forecast \"&E1+10&\"/\"&RIGHT(E1,2)+11","v":"Forecast 2020/21"},"Forecast 2021/22","Forecast 2022/23","Forecast 2023/24","Forecast 2024/25","Forecast 2025/26","Forecast 2026/27","Forecast 2027/28","Forecast 2028/29","Forecast 2029/30","Forecast 2030/31",null,null,null,null,null,null,null,null,null,null,"Infrastructure - Water","Generation"]
[{"$f":"'Template names'!C26","v":"Next yr of long term forecast"},"Forecast 2018/19","Forecast 2019/20","Forecast 2020/21",{"$f":"\"Forecast \"&E1+11&\"/\"&RIGHT(E1,2)+12","v":"Forecast 2021/22"},"Forecast 2022/23","Forecast 2023/24","Forecast 2024/25","Forecast 2025/26","Forecast 2026/27","Forecast 2027/28","Forecast 2028/29","Forecast 2029/30","Forecast 2030/31","Forecast 2031/32",null,null,null,null,null,null,null,null,null,null,"Infrastructure - Sanitation","Transmission & Reticulation"]
[{"$f":"'Template names'!C27","v":"Next yr of long term forecast"},"Forecast 2019/20","Forecast 2020/21","Forecast 2021/22",{"$f":"\"Forecast \"&E1+12&\"/\"&RIGHT(E1,2)+13","v":"Forecast 2022/23"},"Forecast 2023/24","Forecast 2024/25","Forecast 2025/26","Forecast 2026/27","Forecast 2027/28","Forecast 2028/29","Forecast 2029/30","Forecast 2030/31","Forecast 2031/32","Forecast 2032/33",null,null,null,null,null,null,null,null,null,null,"Infrastructure - Other","Street Lighting"]
[{"$f":"'Template names'!C28","v":"Next yr of long term forecast"},"Forecast 2020/21","Forecast 2021/22","Forecast 2022/23",{"$f":"\"Forecast \"&E1+13&\"/\"&RIGHT(E1,2)+14","v":"Forecast 2023/24"},"Forecast 2024/25","Forecast 2025/26","Forecast 2026/27","Forecast 2027/28","Forecast 2028/29","Forecast 2029/30","Forecast 2030/31","Forecast 2031/32","Forecast 2032/33","Forecast 2033/34",null,null,null,null,null,null,null,null,null,null,"Community","Dams & Reservoirs"]
[{"$f":"'Template names'!C29","v":"Next yr of long term forecast"},"Forecast 2021/22","Forecast 2022/23","Forecast 2023/24",{"$f":"\"Forecast \"&E1+14&\"/\"&RIGHT(E1,2)+15","v":"Forecast 2024/25"},"Forecast 2025/26","Forecast 2026/27","Forecast 2027/28","Forecast 2028/29","Forecast 2029/30","Forecast 2030/31","Forecast 2031/32","Forecast 2032/33","Forecast 2033/34","Forecast 2034/35",null,null,null,null,null,null,null,null,null,null,"Heritage Assets","Water purification"]
["Adjustments Budget","Annual target 2007/08","Annual target 2008/09","Annual target 2009/10",{"$f":"\"Annual target \" & E1&\"/\"&RIGHT(E1,2)+1","v":"Annual target 2010/11"},"Annual target 2011/12","Annual target 2012/13","Annual target 2013/14","Annual target 2014/15","Annual target 2015/16","Annual target 2016/17","Annual target 2017/18","Annual target 2018/19","Annual target 2019/20","Annual target 2020/21",null,null,null,null,null,null,null,null,null,null,"Investment Properties","Reticulation"]
[{"$f":"A23","v":"Adjustments Budget"},"Revised target 2007/08","Revised target 2008/09","Revised target 2009/10",{"$f":"\"Revised target \"& E1&\"/\"&RIGHT(E1,2)+1","v":"Revised target 2010/11"},"Revised target 2011/12","Revised target 2012/13","Revised target 2013/14","Revised target 2014/15","Revised target 2015/16","Revised target 2016/17","Revised target 2017/18","Revised target 2018/19","Revised target 2019/20","Revised target 2020/21",null,null,null,null,null,null,null,null,null,null,"Other Assets","Sewerage purification"]
["NOTE: This sheet should not be directly amended - select headings from sheet 'S'",null,null,null,null,null,null,null,null,null,null,null,null,null,null,null,null,null,null,null,null,null,null,null,null,"Agricultural assets","Waste Management"]
[null,null,null,null,null,null,null,null,null,null,null,null,null,null,null,null,null,null,null,null,null,null,null,null,null,"Biological assets","Transportation"]
["Name link",62,null,null,null,null,null,null,null,null,null,null,null,null,null,null,null,null,null,null,null,null,null,null,null,"Intangibles","Gas"]
["Name of Muni",{"$f":"INDEX(B29:B307,B27,1)","v":"FS205 Mafube"},null,null,null,null,null,null,null,null,null,null,null,null,null,null,null,null,null,null,null,null,null,null,null,"Other","Parks & gardens"]
[null,"Choose name from list","Set name on 'Instructions' sheet",null,null,null,null,null,null,null,null,null,null,null,null,null,null,null,null,null,null,null,null,null,null,null,"Sportsfields & stadia"]
[null,"BUF Buffalo City","EC EASTERN CAPE",null,null,null,null,null,null,null,null,null,null,null,null,null,null,null,null,null,null,null,null,null,null,null,"Swimming pools"]
[null,"NMA Nelson Mandela Bay","EC EASTERN CAPE",null,null,null,null,null,null,null,null,null,null,null,null,null,null,null,null,null,null,null,null,null,null,null,"Community halls"]
[null,"EC101 Dr. Beyers Naude","EC EASTERN CAPE",null,null,null,null,null,null,null,null,null,null,null,null,null,null,null,null,null,null,null,null,null,null,null,"Libraries"]
[null,"EC102 Blue Crane Route","EC EASTERN CAPE",null,null,null,null,null,null,null,null,null,null,null,null,null,null,null,null,null,null,null,null,null,null,null,"Recreational facilities"]
[null,"EC104 Makana","EC EASTERN CAPE",null,null,null,null,null,null,null,null,null,null,null,null,null,null,null,null,null,null,null,null,null,null,null,"Fire, safety & emergency"]
[null,"EC105 Ndlambe","EC EASTERN CAPE",null,null,null,null,null,null,null,null,null,null,null,null,null,null,null,null,null,null,null,null,null,null,null,"Security and policing"]
[null,"EC106 Sundays River Valley","EC EASTERN CAPE",null,null,null,null,null,null,null,null,null,null,null,null,null,null,null,null,null,null,null,null,null,null,null,"Buses"]
[null,"EC108 Kouga","EC EASTERN CAPE",null,null,null,null,null,null,null,null,null,null,null,null,null,null,null,null,null,null,null,null,null,null,null,"Clinics"]
[null,"EC109 Kou-Kamma","EC EASTERN CAPE",null,null,null,null,null,null,null,null,null,null,null,null,null,null,null,null,null,null,null,null,null,null,null,"Museums & Art Galleries"]
[null,"DC10 Sarah Baartman","EC EASTERN CAPE",null,null,null,null,null,null,null,null,null,null,null,null,null,null,null,null,null,null,null,null,null,null,null,"Cemeteries"]
[null,"EC121 Mbhashe","EC EASTERN CAPE",null,null,null,null,null,null,null,null,null,null,null,null,null,null,null,null,null,null,null,null,null,null,null,"Social rental housing"]
[null,"EC122 Mnquma","EC EASTERN CAPE",null,null,null,null,null,null,null,null,null,null,null,null,null,null,null,null,null,null,null,null,null,null,null,"Buildings"]
[null,"EC123 Great Kei","EC EASTERN CAPE",null,null,null,null,null,null,null,null,null,null,null,null,null,null,null,null,null,null,null,null,null,null,null,"Housing development"]
[null,"EC124 Amahlathi","EC EASTERN CAPE",null,null,null,null,null,null,null,null,null,null,null,null,null,null,null,null,null,null,null,null,null,null,null,"General vehicles"]
[null,"EC126 Ngqushwa","EC EASTERN CAPE",null,null,null,null,null,null,null,null,null,null,null,null,null,null,null,null,null,null,null,null,null,null,null,"Specialised vehicles - Refuse"]
[null,"EC129 Raymond Mhlaba","EC EASTERN CAPE",null,null,null,null,null,null,null,null,null,null,null,null,null,null,null,null,null,null,null,null,null,null,null,"Specialised vehicles - Fire"]
[null,"DC12 Amathole","EC EASTERN CAPE",null,null,null,null,null,null,null,null,null,null,null,null,null,null,null,null,null,null,null,null,null,null,null,"Specialised vehicles - Conservancy"]
[null,"EC131 Inxuba Yethemba","EC EASTERN CAPE",null,null,null,null,null,null,null,null,null,null,null,null,null,null,null,null,null,null,null,null,null,null,null,"Specialised vehicles - Ambulances"]
[null,"EC135 Intsika Yethu","EC EASTERN CAPE",null,null,null,null,null,null,null,null,null,null,null,null,null,null,null,null,null,null,null,null,null,null,null,"Plant & equipment"]
[null,"EC136 Emalahleni (Ec)","EC EASTERN CAPE",null,null,null,null,null,null,null,null,null,null,null,null,null,null,null,null,null,null,null,null,null,null,null,"Computers - hardware/equipment"]
[null,"EC137 Engcobo","EC EASTERN CAPE",null,null,null,null,null,null,null,null,null,null,null,null,null,null,null,null,null,null,null,null,null,null,null,"Furniture and other office equipment"]
[null,"EC138 Sakhisizwe","EC EASTERN CAPE",null,null,null,null,null,null,null,null,null,null,null,null,null,null,null,null,null,null,null,null,null,null,null,"Abattoirs"]
[null,"EC139 Enoch Mgijima","EC EASTERN CAPE",null,null,null,null,null,null,null,null,null,null,null,null,null,null,null,null,null,null,null,null,null,null,null,"Markets"]
[null,"DC13 Chris Hani","EC EASTERN CAPE",null,null,null,null,null,null,null,null,null,null,null,null,null,null,null,null,null,null,null,null,null,null,null,"Civic Land and Buildings"]
[null,"EC141 Elundini","EC EASTERN CAPE",null,null,null,null,null,null,null,null,null,null,null,null,null,null,null,null,null,null,null,null,null,null,null,"Other Buildings"]
[null,"EC142 Senqu","EC EASTERN CAPE",null,null,null,null,null,null,null,null,null,null,null,null,null,null,null,null,null,null,null,null,null,null,null,"Other Land"]
[null,"EC145 Walter Sisulu","EC EASTERN CAPE",null,null,null,null,null,null,null,null,null,null,null,null,null,null,null,null,null,null,null,null,null,null,null,"Surplus Assets - (Investment or Inventory)"]
[null,"DC14 Joe Gqabi","EC EASTERN CAPE",null,null,null,null,null,null,null,null,null,null,null,null,null,null,null,null,null,null,null,null,null,null,null,"Computers - software & programming"]
[null,"EC153 Ngquza Hills","EC EASTERN CAPE",null,null,null,null,null,null,null,null,null,null,null,null,null,null,null,null,null,null,null,null,null,null,null,"Other"]
[null,"EC154 Port St Johns","EC EASTERN CAPE"]
[null,"EC155 Nyandeni","EC EASTERN CAPE",null,null,null,null,null,null,null,null,null,null,null,null,null,null,null,null,null,null,null,null,null,null,"SA16 - Investments"]
[null,"EC156 Mhlontlo","EC EASTERN CAPE",null,null,null,null,null,null,null,null,null,null,null,null,null,null,null,null,null,null,null,null,null,null,"Security","Interest rate"]
[null,"EC157 King Sabata Dalindyebo","EC EASTERN CAPE",null,null,null,null,null,null,null,null,null,null,null,null,null,null,null,null,null,null,null,null,null,null,"Yes","Fixed"]
[null,"DC15 O .R. Tambo","EC EASTERN CAPE",null,null,null,null,null,null,null,null,null,null,null,null,null,null,null,null,null,null,null,null,null,null,"No","Variable"]
[null,"EC441 Matatiele","EC EASTERN CAPE"]
[null,"EC442 Umzimvubu","EC EASTERN CAPE"]
[null,"EC443 Mbizana","EC EASTERN CAPE",null,null,null,null,null,null,null,null,null,null,null,null,null,null,null,null,null,null,null,null,null,null,"SA36, SA37 - Capital projects"]
[null,"EC444 Ntabankulu","EC EASTERN CAPE",null,null,null,null,null,null,null,null,null,null,null,null,null,null,null,null,null,null,null,null,null,null,"Yes"]
[null,"DC44 Alfred Nzo","EC EASTERN CAPE",null,null,null,null,null,null,null,null,null,null,null,null,null,null,null,null,null,null,null,null,null,null,"No"]
[null,"MAN Mangaung","FS FREE STATE"]
[null,"FS161 Letsemeng","FS FREE STATE"]
[null,"FS162 Kopanong","FS FREE STATE"]
[null,"FS163 Mohokare","FS FREE STATE"]
[null,"DC16 Xhariep","FS FREE STATE"]
[null,"FS181 Masilonyana","FS FREE STATE"]
[null,"FS182 Tokologo","FS FREE STATE"]
[null,"FS183 Tswelopele","FS FREE STATE"]
[null,"FS184 Matjhabeng","FS FREE STATE"]
[null,"FS185 Nala","FS FREE STATE"]
[null,"DC18 Lejweleputswa","FS FREE STATE"]
[null,"FS191 Setsoto","FS FREE STATE"]
[null,"FS192 Dihlabeng","FS FREE STATE"]
[null,"FS193 Nketoana","FS FREE STATE"]
[null,"FS194 Maluti-a-Phofung","FS FREE STATE"]
[null,"FS195 Phumelela","FS FREE STATE"]
[null,"FS196 Mantsopa","FS FREE STATE"]
[null,"DC19 Thabo Mofutsanyana","FS FREE STATE"]
[null,"FS201 Moqhaka","FS FREE STATE"]
[null,"FS203 Ngwathe","FS FREE STATE"]
[null,"FS204 Metsimaholo","FS FREE STATE"]
[null,"FS205 Mafube","FS FREE STATE"]
[null,"DC20 Fezile Dabi","FS FREE STATE"]
[null,"EKU Ekurhuleni Metro","GT GAUTENG"]
[null,"JHB City Of Johannesburg","GT GAUTENG"]
[null,"TSH City Of Tshwane","GT GAUTENG"]
[null,"GT421 Emfuleni","GT GAUTENG"]
[null,"GT422 Midvaal","GT GAUTENG"]
[null,"GT423 Lesedi","GT GAUTENG"]
[null,"DC42 Sedibeng","GT GAUTENG"]
[null,"GT481 Mogale City","GT GAUTENG"]
[null,"GT484 Merafong City","GT GAUTENG"]
[null,"GT485 GT485","GT GAUTENG"]
[null,"DC48 West Rand","GT GAUTENG"]
[null,"ETH eThekwini","KZN KWAZULU-NATAL"]
[null,"KZN212 Umdoni","KZN KWAZULU-NATAL"]
[null,"KZN213 Umzumbe","KZN KWAZULU-NATAL"]
[null,"KZN214 uMuziwabantu","KZN KWAZULU-NATAL"]
[null,"KZN216 Ray Nkonyeni","KZN KWAZULU-NATAL"]
[null,"DC21 Ugu","KZN KWAZULU-NATAL"]
[null,"KZN221 uMshwathi","KZN KWAZULU-NATAL"]
[null,"KZN222 uMngeni","KZN KWAZULU-NATAL"]
[null,"KZN223 Mpofana","KZN KWAZULU-NATAL"]
[null,"KZN224 Impendle","KZN KWAZULU-NATAL"]
[null,"KZN225 Msunduzi","KZN KWAZULU-NATAL"]
[null,"KZN226 Mkhambathini","KZN KWAZULU-NATAL"]
[null,"KZN227 Richmond","KZN KWAZULU-NATAL"]
[null,"DC22 uMgungundlovu","KZN KWAZULU-NATAL"]
[null,"KZN235 Okhahlamba","KZN KWAZULU-NATAL"]
[null,"KZN237 Inkosi Langalibalele","KZN KWAZULU-NATAL"]
[null,"KZN238 Alfred Duma","KZN KWAZULU-NATAL"]
[null,"DC23 Uthukela","KZN KWAZULU-NATAL"]
[null,"KZN241 Endumeni","KZN KWAZULU-NATAL"]
[null,"KZN242 Nquthu","KZN KWAZULU-NATAL"]
[null,"KZN244 Msinga","KZN KWAZULU-NATAL"]
[null,"KZN245 Umvoti","KZN KWAZULU-NATAL"]
[null,"DC24 Umzinyathi","KZN KWAZULU-NATAL"]
[null,"KZN252 Newcastle","KZN KWAZULU-NATAL"]
[null,"KZN253 eMadlangeni","KZN KWAZULU-NATAL"]
[null,"KZN254 Dannhauser","KZN KWAZULU-NATAL"]
[null,"DC25 Amajuba","KZN KWAZULU-NATAL"]
[null,"KZN261 eDumbe","KZN KWAZULU-NATAL"]
[null,"KZN262 uPhongolo","KZN KWAZULU-NATAL"]
[null,"KZN263 Abaqulusi","KZN KWAZULU-NATAL"]
[null,"KZN265 Nongoma","KZN KWAZULU-NATAL"]
[null,"KZN266 Ulundi","KZN KWAZULU-NATAL"]
[null,"DC26 Zululand","KZN KWAZULU-NATAL"]
[null,"KZN271 Umhlabuyalingana","KZN KWAZULU-NATAL"]
[null,"KZN272 Jozini","KZN KWAZULU-NATAL"]
[null,"KZN275 Mtubatuba","KZN KWAZULU-NATAL"]
[null,"KZN276 The New Big 5 False Bay","KZN KWAZULU-NATAL"]
[null,"DC27 Umkhanyakude","KZN KWAZULU-NATAL"]
[null,"KZN281 Mfolozi","KZN KWAZULU-NATAL"]
[null,"KZN282 uMhlathuze","KZN KWAZULU-NATAL"]
[null,"KZN284 uMlalazi","KZN KWAZULU-NATAL"]
[null,"KZN285 Mthonjaneni","KZN KWAZULU-NATAL"]
[null,"KZN286 Nkandla","KZN KWAZULU-NATAL"]
[null,"DC28 King Cetshwayo","KZN KWAZULU-NATAL"]
[null,"KZN291 Mandeni","KZN KWAZULU-NATAL"]
[null,"KZN292 KwaDukuza","KZN KWAZULU-NATAL"]
[null,"KZN293 Ndwedwe","KZN KWAZULU-NATAL"]
[null,"KZN294 Maphumulo","KZN KWAZULU-NATAL"]
[null,"DC29 iLembe","KZN KWAZULU-NATAL"]
[null,"KZN433 Greater Kokstad","KZN KWAZULU-NATAL"]
[null,"KZN434 Ubuhlebezwe","KZN KWAZULU-NATAL"]
[null,"KZN435 Umzimkhulu","KZN KWAZULU-NATAL"]
[null,"KZN436 Dr Nkosazana Dlamini Zuma","KZN KWAZULU-NATAL"]
[null,"DC43 Harry Gwala","KZN KWAZULU-NATAL"]
[null,"LIM331 Greater Giyani","LIM LIMPOPO"]
[null,"LIM332 Greater Letaba","LIM LIMPOPO"]
[null,"LIM333 Greater Tzaneen","LIM LIMPOPO"]
[null,"LIM334 Ba-Phalaborwa","LIM LIMPOPO"]
[null,"LIM335 Maruleng","LIM LIMPOPO"]
[null,"DC33 Mopani","LIM LIMPOPO"]
[null,"LIM341 Musina","LIM LIMPOPO"]
[null,"LIM343 Thulamela","LIM LIMPOPO"]
[null,"LIM344 Makhado","LIM LIMPOPO"]
[null,"LIM345 LIM345","LIM LIMPOPO"]
[null,"DC34 Vhembe","LIM LIMPOPO"]
[null,"LIM351 Blouberg","LIM LIMPOPO"]
[null,"LIM353 Molemole","LIM LIMPOPO"]
[null,"LIM354 Polokwane","LIM LIMPOPO"]
[null,"LIM355 Lepelle-Nkumpi","LIM LIMPOPO"]
[null,"DC35 Capricorn","LIM LIMPOPO"]
[null,"LIM361 Thabazimbi","LIM LIMPOPO"]
[null,"LIM362 Lephalale","LIM LIMPOPO"]
[null,"LIM366 Bela Bela","LIM LIMPOPO"]
[null,"LIM367 Mogalakwena","LIM LIMPOPO"]
[null,"LIM368 LIM368","LIM LIMPOPO"]
[null,"DC36 Waterberg","LIM LIMPOPO"]
[null,"LIM471 Ephraim Mogale","LIM LIMPOPO"]
[null,"LIM472 Elias Motsoaledi","LIM LIMPOPO"]
[null,"LIM473 Makhuduthamaga","LIM LIMPOPO"]
[null,"LIM476 LIM476","LIM LIMPOPO"]
[null,"DC47 Sekhukhune","LIM LIMPOPO"]
[null,"MP301 Albert Luthuli","MP MPUMALANGA"]
[null,"MP302 Msukaligwa","MP MPUMALANGA"]
[null,"MP303 Mkhondo","MP MPUMALANGA"]
[null,"MP304 Pixley Ka Seme (MP)","MP MPUMALANGA"]
[null,"MP305 Lekwa","MP MPUMALANGA"]
[null,"MP306 Dipaleseng","MP MPUMALANGA"]
[null,"MP307 Govan Mbeki","MP MPUMALANGA"]
[null,"DC30 Gert Sibande","MP MPUMALANGA"]
[null,"MP311 Victor Khanye","MP MPUMALANGA"]
[null,"MP312 Emalahleni (Mp)","MP MPUMALANGA"]
[null,"MP313 Steve Tshwete","MP MPUMALANGA"]
[null,"MP314 Emakhazeni","MP MPUMALANGA"]
[null,"MP315 Thembisile Hani","MP MPUMALANGA"]
[null,"MP316 Dr J.S. Moroka","MP MPUMALANGA"]
[null,"DC31 Nkangala","MP MPUMALANGA"]
[null,"MP321 Thaba Chweu","MP MPUMALANGA"]
[null,"MP324 Nkomazi","MP MPUMALANGA"]
[null,"MP325 Bushbuckridge","MP MPUMALANGA"]
[null,"MP326 City of Mbombela","MP MPUMALANGA"]
[null,"DC32 Ehlanzeni","MP MPUMALANGA"]
[null,"NC451 Joe Morolong","NC NORTHERN CAPE"]
[null,"NC452 Ga-Segonyana","NC NORTHERN CAPE"]
[null,"NC453 Gamagara","NC NORTHERN CAPE"]
[null,"DC45 John Taolo Gaetsewe","NC NORTHERN CAPE"]
[null,"NC061 Richtersveld","NC NORTHERN CAPE"]
[null,"NC062 Nama Khoi","NC NORTHERN CAPE"]
[null,"NC064 Kamiesberg","NC NORTHERN CAPE"]
[null,"NC065 Hantam","NC NORTHERN CAPE"]
[null,"NC066 Karoo Hoogland","NC NORTHERN CAPE"]
[null,"NC067 Khai-Ma","NC NORTHERN CAPE"]
[null,"DC6 Namakwa","NC NORTHERN CAPE"]
[null,"NC071 Ubuntu","NC NORTHERN CAPE"]
[null,"NC072 Umsobomvu","NC NORTHERN CAPE"]
[null,"NC073 Emthanjeni","NC NORTHERN CAPE"]
[null,"NC074 Kareeberg","NC NORTHERN CAPE"]
[null,"NC075 Renosterberg","NC NORTHERN CAPE"]
[null,"NC076 Thembelihle","NC NORTHERN CAPE"]
[null,"NC077 Siyathemba","NC NORTHERN CAPE"]
[null,"NC078 Siyancuma","NC NORTHERN CAPE"]
[null,"DC7 Pixley Ka Seme (Nc)","NC NORTHERN CAPE"]
[null,"NC082 !Kai! Garib","NC NORTHERN CAPE"]
[null,"NC084 !Kheis","NC NORTHERN CAPE"]
[null,"NC085 Tsantsabane","NC NORTHERN CAPE"]
[null,"NC086 Kgatelopele","NC NORTHERN CAPE"]
[null,"NC087 Dawid Kuiper","NC NORTHERN CAPE"]
[null,"DC8 Z F Mgcawu","NC NORTHERN CAPE"]
[null,"NC091 Sol Plaatje","NC NORTHERN CAPE"]
[null,"NC092 Dikgatlong","NC NORTHERN CAPE"]
[null,"NC093 Magareng","NC NORTHERN CAPE"]
[null,"NC094 Phokwane","NC NORTHERN CAPE"]
[null,"DC9 Frances Baard","NC NORTHERN CAPE"]
[null,"NW371 Moretele","NW NORTH WEST"]
[null,"NW372 Madibeng","NW NORTH WEST"]
[null,"NW373 Rustenburg","NW NORTH WEST"]
[null,"NW374 Kgetlengrivier","NW NORTH WEST"]
[null,"NW375 Moses Kotane","NW NORTH WEST"]
[null,"DC37 Bojanala Platinum","NW NORTH WEST"]
[null,"NW381 Ratlou","NW NORTH WEST"]
[null,"NW382 Tswaing","NW NORTH WEST"]
[null,"NW383 Mafikeng","NW NORTH WEST"]
[null,"NW384 Ditsobotla","NW NORTH WEST"]
[null,"NW385 Ramotshere Moiloa","NW NORTH WEST"]
[null,"DC38 Ngaka Modiri Molema","NW NORTH WEST"]
[null,"NW392 Naledi (Nw)","NW NORTH WEST"]
[null,"NW393 Mamusa","NW NORTH WEST"]
[null,"NW394 Greater Taung","NW NORTH WEST"]
[null,"NW396 Lekwa-Teemane","NW NORTH WEST"]
[null,"NW397 Kagisano-Molopo","NW NORTH WEST"]
[null,"DC39 Dr Ruth Segomotsi Mompati","NW NORTH WEST"]
[null,"NW403 City Of Matlosana","NW NORTH WEST"]
[null,"NW404 Maquassi Hills","NW NORTH WEST"]
[null,"NW405 NW405","NW NORTH WEST"]
[null,"DC40 Dr Kenneth Kaunda","NW NORTH WEST"]
[null,"CPT Cape Town","WC WESTERN CAPE"]
[null,"WC011 Matzikama","WC WESTERN CAPE"]
[null,"WC012 Cederberg","WC WESTERN CAPE"]
[null,"WC013 Bergrivier","WC WESTERN CAPE"]
[null,"WC014 Saldanha Bay","WC WESTERN CAPE"]
[null,"WC015 Swartland","WC WESTERN CAPE"]
[null,"DC1 West Coast","WC WESTERN CAPE"]
[null,"WC022 Witzenberg","WC WESTERN CAPE"]
[null,"WC023 Drakenstein","WC WESTERN CAPE"]
[null,"WC024 Stellenbosch","WC WESTERN CAPE"]
[null,"WC025 Breede Valley","WC WESTERN CAPE"]
[null,"WC026 Langeberg","WC WESTERN CAPE"]
[null,"DC2 Cape Winelands DM","WC WESTERN CAPE"]
[null,"WC031 Theewaterskloof","WC WESTERN CAPE"]
[null,"WC032 Overstrand","WC WESTERN CAPE"]
[null,"WC033 Cape Agulhas","WC WESTERN CAPE"]
[null,"WC034 Swellendam","WC WESTERN CAPE"]
[null,"DC3 Overberg","WC WESTERN CAPE"]
[null,"WC041 Kannaland","WC WESTERN CAPE"]
[null,"WC042 Hessequa","WC WESTERN CAPE"]
[null,"WC043 Mossel Bay","WC WESTERN CAPE"]
[null,"WC044 George","WC WESTERN CAPE"]
[null,"WC045 Oudtshoorn","WC WESTERN CAPE"]
[null,"WC047 Bitou","WC WESTERN CAPE"]
[null,"WC048 Knysna","WC WESTERN CAPE"]
[null,"DC4 Eden","WC WESTERN CAPE"]
[null,"WC051 Laingsburg","WC WESTERN CAPE"]
[null,"WC052 Prince Albert","WC WESTERN CAPE"]
[null,"WC053 Beaufort West","WC WESTERN CAPE"]
[null,"DC5 Central Karoo","WC WESTERN CAPE"]
[]
[]
[]
[]
[]
[]
[]
[]
[]
[]
[]
[]
[]
[]
[]
[]
[]
[]
[]
[]
[]
[null,{"$f":"COUNTA(B30:B307)","v":257}]

{"sheet":"Org structure","index":4,"n_rows":166,"n_cols":5,"rows_kept":166,"cut":false,"hidden":false,"merged":[]}
["Organisational Structure Votes",null,"Organisational Structure Sub-Votes",null,"Display Sub-Votes"]
[{"$f":"B2&\" - \"&C2","v":"Vote 1 - OFFICE OF THE MAYOR"},"Vote 1","OFFICE OF THE MAYOR"]
[{"$f":"B13&\" - \"& C13","v":"Vote 2 - OFFICE OF THE SPEAKER"},1.1000000000000001,"Office of the mayor",{"$f":"CONCATENATE(B3, \" - \", C3)","v":"1.1 - Office of the mayor"},"1,1 - Office of the mayor"]
[{"$f":"B24&\" - \"&C24","v":"Vote 3 - OFFICE OF THE MUNICIPAL MANAGER"},1.2,"[Name of sub-vote]","1.2 - [Name of sub-vote]"]
[{"$f":"B35&\" - \"&C35","v":"Vote 4 - COMMUNITY SERVICES"},1.3,"[Name of sub-vote]","1.3 - [Name of sub-vote]"]
[{"$f":"B46&\" - \"&C46","v":"Vote 5 - CORPORATE SERVICES"},1.4,"[Name of sub-vote]","1.4 - [Name of sub-vote]"]
[{"$f":"B57&\" - \"&C57","v":"Vote 6 - FINANCIAL SERVICES"},1.5,"[Name of sub-vote]","1.5 - [Name of sub-vote]"]
[{"$f":"B68&\" - \"&C68","v":"Vote 7 - INFRASTRUCTURE SERVICES"},1.6,"[Name of sub-vote]","1.6 - [Name of sub-vote]"]
[{"$f":"B79&\" - \"&C79","v":"Vote 8 - SERVICE DELIVERY AND PUBLIC SAFETY"},1.7,"[Name of sub-vote]","1.7 - [Name of sub-vote]"]
[{"$f":"B90&\" - \"&C90","v":"Vote 9 - [NAME OF VOTE 9]"},1.8,"[Name of sub-vote]","1.8 - [Name of sub-vote]"]
[{"$f":"B101&\" - \"&C101","v":"Vote 10 - [NAME OF VOTE 10]"},1.9,"[Name of sub-vote]","1.9 - [Name of sub-vote]"]
[{"$f":"B112&\" - \"&C112","v":"Vote 11 - [NAME OF VOTE 11]"},"1.10","[Name of sub-vote]","1.10 - [Name of sub-vote]"]
[{"$f":"B123&\" - \"&C123","v":"Vote 12 - [NAME OF VOTE 12]"},"Vote 2","OFFICE OF THE SPEAKER"]
[{"$f":"B134&\" - \"&C134","v":"Vote 13 - [NAME OF VOTE 13]"},2.1,"Office of the speaker",{"$f":"CONCATENATE(B14, \" - \", C14)","v":"2.1 - Office of the speaker"},"2,1 - Office of the speaker"]
[{"$f":"B145&\" - \"&C145","v":"Vote 14 - [NAME OF VOTE 14]"},2.2000000000000002,"[Name of sub-vote]","2.2 - [Name of sub-vote]"]
[{"$f":"B156&\" - \"&C156","v":"Vote 15 - [NAME OF VOTE 15]"},2.2999999999999998,"[Name of sub-vote]","2.3 - [Name of sub-vote]"]
[null,2.4,"[Name of sub-vote]","2.4 - [Name of sub-vote]"]
[null,2.5,"[Name of sub-vote]","2.5 - [Name of sub-vote]"]
[null,2.6,"[Name of sub-vote]","2.6 - [Name of sub-vote]"]
[null,2.7,"[Name of sub-vote]","2.7 - [Name of sub-vote]"]
[null,2.8,"[Name of sub-vote]","2.8 - [Name of sub-vote]"]
[null,2.9,"[Name of sub-vote]","2.9 - [Name of sub-vote]"]
[null,"2.10","[Name of sub-vote]","2.10 - [Name of sub-vote]"]
[null,"Vote 3","OFFICE OF THE MUNICIPAL MANAGER"]
[null,3.1,"Municipal Manager Administration",{"$f":"CONCATENATE(B25, \" - \", C25)","v":"3.1 - Municipal Manager Administration"},"3,1 - Municipal Manager Administration"]
[null,3.2,"Internal Audit","3.2 - Internal Audit","3,2 - Internal Audit"]
[null,3.3,"PMS/IDP","3.3 - PMS/IDP","3,3 - PMS/IDP"]
[null,3.4,"Information Technology","3.4 - Information Technology","3,4 - Information Technology"]
[null,3.5,"Villiers","3.5 - Villiers","3,5 - Villiers"]
[null,3.6,"Tweeling","3.6 - Tweeling","3,6 - Tweeling"]
[null,3.7,"Cornelia","3.7 - Cornelia","3,7 - Cornelia"]
[null,3.8,"Local Economic Development","3.8 - Local Economic Development","3,8 - Local Economic Development"]
[null,3.9,"Town Planning","3.9 - Town Planning","3,9 - Town Planning"]
[null,"3.10","[Name of sub-vote]","3.10 - [Name of sub-vote]"]
[null,"Vote 4","COMMUNITY SERVICES"]
[null,4.0999999999999996,"Enviromental Management",{"$f":"CONCATENATE(B36, \" - \", C36)","v":"4.1 - Enviromental Management"},"4,1 - Enviromental Management"]
[null,4.2,"Social Development","4.2 - Social Development","4,2 - Social Development"]
[null,4.3,"Local Economic Development","4.3 - Local Economic Development","4,3 - Local Economic Development"]
[null,4.4000000000000004,"[Name of sub-vote]","4.4 - [Name of sub-vote]"]
[null,4.5,"[Name of sub-vote]","4.5 - [Name of sub-vote]"]
[null,4.5999999999999996,"[Name of sub-vote]","4.6 - [Name of sub-vote]"]
[null,4.7,"[Name of sub-vote]","4.7 - [Name of sub-vote]"]
[null,4.8,"[Name of sub-vote]","4.8 - [Name of sub-vote]"]
[null,4.9000000000000004,"[Name of sub-vote]","4.9 - [Name of sub-vote]"]
[null,"4.10","[Name of sub-vote]","4.10 - [Name of sub-vote]"]
[null,"Vote 5","CORPORATE SERVICES"]
[null,5.0999999999999996,"Administration and Legal",{"$f":"CONCATENATE(B47, \" - \", C47)","v":"5.1 - Administration and Legal"},"5,1 - Administration and Legal"]
[null,5.2,"Human Resources","5.2 - Human Resources","5,2 - Human Resources"]
[null,5.3,"Property and Ground Management","5.3 - Property and Ground Management","5,3 - Property and Ground Management"]
[null,5.4,"Security Services","5.4 - Security Services","5,4 - Security Services"]
[null,5.5,"[Name of sub-vote]","5.5 - [Name of sub-vote]"]
[null,5.6,"[Name of sub-vote]","5.6 - [Name of sub-vote]"]
[null,5.7,"[Name of sub-vote]","5.7 - [Name of sub-vote]"]
[null,5.8,"[Name of sub-vote]","5.8 - [Name of sub-vote]"]
[null,5.9,"[Name of sub-vote]","5.9 - [Name of sub-vote]"]
[null,"5.10","[Name of sub-vote]","5.10 - [Name of sub-vote]"]
[null,"Vote 6","FINANCIAL SERVICES"]
[null,6.1,"Revenue and Budget Management",{"$f":"CONCATENATE(B58, \" - \", C58)","v":"6.1 - Revenue and Budget Management"},"6,1 - Revenue and Budget Management"]
[null,6.2,"Budget Management","6.2 - Budget Management","6,2 - Budget Management"]
[null,6.3,"Expenditure Management","6.3 - Expenditure Management","6,3 - Expenditure Management"]
[null,6.4,"Supply Chain Management","6.4 - Supply Chain Management","6,4 - Supply Chain Management"]
[null,6.5,"Financial Accounting","6.5 - Financial Accounting","6,5 - Financial Accounting"]
[null,6.6,"Revenue & Budget","6.6 - Revenue & Budget","6,6 - Revenue & Budget"]
[null,6.7,"SCM & Expenditure","6.7 - SCM & Expenditure","6,7 - SCM & Expenditure"]
[null,6.8,"[Name of sub-vote]","6.8 - [Name of sub-vote]"]
[null,6.9,"[Name of sub-vote]","6.9 - [Name of sub-vote]"]
[null,"6.10","[Name of sub-vote]","6.10 - [Name of sub-vote]"]
[null,"Vote 7","INFRASTRUCTURE SERVICES"]
[null,7.1,"Town Planning",{"$f":"CONCATENATE(B69, \" - \", C69)","v":"7.1 - Town Planning"},"7,1 - Town Planning"]
[null,7.2,"Project Management Unit ","7.2 - Project Management Unit ","7,2 - Project Management Unit "]
[null,7.3,"Roads and Stormwater","7.3 - Roads and Stormwater","7,3 - Roads and Stormwater"]
[null,7.4,"Electricity and Mechanical","7.4 - Electricity and Mechanical","7,4 - Electricity and Mechanical"]
[null,7.5,"Water and Sanitation","7.5 - Water and Sanitation","7,5 - Water and Sanitation"]
[null,7.6,"Water testing","7.6 - Water testing","7,6 - Water testing"]
[null,7.7,"Pump and Electrical Maintenance","7.7 - Pump and Electrical Maintenance","7,7 - Pump and Electrical Maintenance"]
[null,7.8,"Other","7.8 - Other"]
[null,7.9,"[Name of sub-vote]","7.9 - [Name of sub-vote]"]
[null,"7.10","[Name of sub-vote]","7.10 - [Name of sub-vote]"]
[null,"Vote 8","SERVICE DELIVERY AND PUBLIC SAFETY"]
[null,8.1,"Villiers",{"$f":"CONCATENATE(B80, \" - \", C80)","v":"8.1 - Villiers"},"8,1 - Villiers"]
[null,8.1999999999999993,"Tweeling","8.2 - Tweeling","8,2 - Tweeling"]
[null,8.3000000000000007,"Cornelia","8.3 - Cornelia","8,3 - Cornelia"]
[null,8.4,"Public Safety","8.4 - Public Safety","8,4 - Public Safety"]
[null,8.5,"[Name of sub-vote]","8.5 - [Name of sub-vote]"]
[null,8.6,"[Name of sub-vote]","8.6 - [Name of sub-vote]"]
[null,8.6999999999999993,"[Name of sub-vote]","8.7 - [Name of sub-vote]"]
[null,8.8000000000000007,"[Name of sub-vote]","8.8 - [Name of sub-vote]"]
[null,8.9,"[Name of sub-vote]","8.9 - [Name of sub-vote]"]
[null,"8.10","[Name of sub-vote]","8.10 - [Name of sub-vote]"]
[null,"Vote 9","[NAME OF VOTE 9]"]
[null,9.1,"[Name of sub-vote]",{"$f":"CONCATENATE(B91, \" - \", C91)","v":"9.1 - [Name of sub-vote]"},"9.1 - [Name of sub-vote]"]
[null,9.1999999999999993,"[Name of sub-vote]","9.2 - [Name of sub-vote]"]
[null,9.3000000000000007,"[Name of sub-vote]","9.3 - [Name of sub-vote]"]
[null,9.4,"[Name of sub-vote]","9.4 - [Name of sub-vote]"]
[null,9.5,"[Name of sub-vote]","9.5 - [Name of sub-vote]"]
[null,9.6,"[Name of sub-vote]","9.6 - [Name of sub-vote]"]
[null,9.6999999999999993,"[Name of sub-vote]","9.7 - [Name of sub-vote]"]
[null,9.8000000000000007,"[Name of sub-vote]","9.8 - [Name of sub-vote]"]
[null,9.9,"[Name of sub-vote]","9.9 - [Name of sub-vote]"]
[null,"9.10","[Name of sub-vote]","9.10 - [Name of sub-vote]"]
[null,"Vote 10","[NAME OF VOTE 10]"]
[null,10.1,"[Name of sub-vote]",{"$f":"CONCATENATE(B102, \" - \", C102)","v":"10.1 - [Name of sub-vote]"},"10.1 - [Name of sub-vote]"]
[null,10.199999999999999,"[Name of sub-vote]","10.2 - [Name of sub-vote]"]
[null,10.3,"[Name of sub-vote]","10.3 - [Name of sub-vote]"]
[null,10.4,"[Name of sub-vote]","10.4 - [Name of sub-vote]"]
[null,10.5,"[Name of sub-vote]","10.5 - [Name of sub-vote]"]
[null,10.6,"[Name of sub-vote]","10.6 - [Name of sub-vote]"]
[null,10.7,"[Name of sub-vote]","10.7 - [Name of sub-vote]"]
[null,10.8,"[Name of sub-vote]","10.8 - [Name of sub-vote]"]
[null,10.9,"[Name of sub-vote]","10.9 - [Name of sub-vote]"]
[null,"10.10","[Name of sub-vote]","10.10 - [Name of sub-vote]"]
[null,"Vote 11","[NAME OF VOTE 11]"]
[null,11.1,"[Name of sub-vote]",{"$f":"CONCATENATE(B113, \" - \", C113)","v":"11.1 - [Name of sub-vote]"},"11.1 - [Name of sub-vote]"]
[null,11.2,"[Name of sub-vote]","11.2 - [Name of sub-vote]"]
[null,11.3,"[Name of sub-vote]","11.3 - [Name of sub-vote]"]
[null,11.4,"[Name of sub-vote]","11.4 - [Name of sub-vote]"]
[null,11.5,"[Name of sub-vote]","11.5 - [Name of sub-vote]"]
[null,11.6,"[Name of sub-vote]","11.6 - [Name of sub-vote]"]
[null,11.7,"[Name of sub-vote]","11.7 - [Name of sub-vote]"]
[null,11.8,"[Name of sub-vote]","11.8 - [Name of sub-vote]"]
[null,11.9,"[Name of sub-vote]","11.9 - [Name of sub-vote]"]
[null,"11.10","[Name of sub-vote]","11.10 - [Name of sub-vote]"]
[null,"Vote 12","[NAME OF VOTE 12]"]
[null,12.1,"[Name of sub-vote]",{"$f":"CONCATENATE(B124, \" - \", C124)","v":"12.1 - [Name of sub-vote]"},"12.1 - [Name of sub-vote]"]
[null,12.2,"[Name of sub-vote]","12.2 - [Name of sub-vote]"]
[null,12.3,"[Name of sub-vote]","12.3 - [Name of sub-vote]"]
[null,12.4,"[Name of sub-vote]","12.4 - [Name of sub-vote]"]
[null,12.5,"[Name of sub-vote]","12.5 - [Name of sub-vote]"]
[null,12.6,"[Name of sub-vote]","12.6 - [Name of sub-vote]"]
[null,12.7,"[Name of sub-vote]","12.7 - [Name of sub-vote]"]
[null,12.8,"[Name of sub-vote]","12.8 - [Name of sub-vote]"]
[null,12.9,"[Name of sub-vote]","12.9 - [Name of sub-vote]"]
[null,"12.10","[Name of sub-vote]","12.10 - [Name of sub-vote]"]
[null,"Vote 13","[NAME OF VOTE 13]"]
[null,13.1,"[Name of sub-vote]",{"$f":"CONCATENATE(B135, \" - \", C135)","v":"13.1 - [Name of sub-vote]"},"13.1 - [Name of sub-vote]"]
[null,13.2,"[Name of sub-vote]","13.2 - [Name of sub-vote]"]
[null,13.3,"[Name of sub-vote]","13.3 - [Name of sub-vote]"]
[null,13.4,"[Name of sub-vote]","13.4 - [Name of sub-vote]"]
[null,13.5,"[Name of sub-vote]","13.5 - [Name of sub-vote]"]
[null,13.6,"[Name of sub-vote]","13.6 - [Name of sub-vote]"]
[null,13.7,"[Name of sub-vote]","13.7 - [Name of sub-vote]"]
[null,13.8,"[Name of sub-vote]","13.8 - [Name of sub-vote]"]
[null,13.9,"[Name of sub-vote]","13.9 - [Name of sub-vote]"]
[null,"13.10","[Name of sub-vote]","13.10 - [Name of sub-vote]"]
[null,"Vote 14","[NAME OF VOTE 14]"]
[null,14.1,"[Name of sub-vote]",{"$f":"CONCATENATE(B146, \" - \", C146)","v":"14.1 - [Name of sub-vote]"},"14.1 - [Name of sub-vote]"]
[null,14.2,"[Name of sub-vote]","14.2 - [Name of sub-vote]"]
[null,14.3,"[Name of sub-vote]","14.3 - [Name of sub-vote]"]
[null,14.4,"[Name of sub-vote]","14.4 - [Name of sub-vote]"]
[null,14.5,"[Name of sub-vote]","14.5 - [Name of sub-vote]"]
[null,14.6,"[Name of sub-vote]","14.6 - [Name of sub-vote]"]
[null,14.7,"[Name of sub-vote]","14.7 - [Name of sub-vote]"]
[null,14.8,"[Name of sub-vote]","14.8 - [Name of sub-vote]"]
[null,14.9,"[Name of sub-vote]","14.9 - [Name of sub-vote]"]
[null,"14.10","[Name of sub-vote]","14.10 - [Name of sub-vote]"]
[null,"Vote 15","[NAME OF VOTE 15]"]
[null,15.1,"[Name of sub-vote]",{"$f":"CONCATENATE(B157, \" - \", C157)","v":"15.1 - [Name of sub-vote]"},"15.1 - [Name of sub-vote]"]
[null,15.2,"[Name of sub-vote]","15.2 - [Name of sub-vote]"]
[null,15.3,"[Name of sub-vote]","15.3 - [Name of sub-vote]"]
[null,15.4,"[Name of sub-vote]","15.4 - [Name of sub-vote]"]
[null,15.5,"[Name of sub-vote]","15.5 - [Name of sub-vote]"]
[null,15.6,"[Name of sub-vote]","15.6 - [Name of sub-vote]"]
[null,15.7,"[Name of sub-vote]","15.7 - [Name of sub-vote]"]
[null,15.8,"[Name of sub-vote]","15.8 - [Name of sub-vote]"]
[null,15.9,"[Name of sub-vote]","15.9 - [Name of sub-vote]"]
[null,"15.10","[Name of sub-vote]","15.10 - [Name of sub-vote]"]

{"sheet":"Contacts","index":5,"n_rows":84,"n_cols":4,"rows_kept":84,"cut":false,"hidden":false,"merged":[[78,0,78,1],[78,2,78,3],[66,0,66,1],[51,0,51,1],[66,2,66,3],[72,2,72,3],[59,2,59,3],[51,2,51,3],[52,2,52,3],[30,2,30,3],[72,0,72,1],[44,0,44,1],[37,0,37,1],[37,2,37,3],[44,2,44,3],[7,2,7,3],[13,0,13,1],[29,0,29,1],[10,2,10,3],[12,2,12,3],[29,2,29,3]]}
[{"$f":"muni&\" - \"&\" Contact Information\"","v":"FS205 Mafube -  Contact Information"}]
[]
["A. GENERAL INFORMATION"]
["Municipality",{"$f":"muni","v":"FS205 Mafube"},{"$f":"IF(B4=\"Choose name from List\",\"Set name on 'Instructions' sheet\", \"\")","v":""}]
[]
["Grade",null,"1 Grade in terms of the Remuneration of Public Office Bearers Act."]
[]
["Province",{"$f":"IF(B4>\" \",VLOOKUP(B4,'Lookup and lists'!B29:C307,2, FALSE),\" \")","v":"FS FREE STATE"}]
[]
["Web Address"]
[]
["e-mail Address","info@mafube.org.za"]
[]
["B. CONTACT INFORMATION"]
["Postal address:"]
["P.O. Box","P.O. BOX 2"]
["City / Town","FRANKFORT"]
["Postal Code",9830]
[]
["Street address"]
["Building",64]
["Street No. & Name","JJ HADEBE STREET"]
["City / Town","FRANKFORT"]
["Postal Code",9830]
[]
["General Contacts"]
["Telephone number","0588139700"]
["Fax number","0588133072"]
[]
["C. POLITICAL LEADERSHIP"]
["Speaker:",null,"Secretary/PA to the Speaker:"]
["Name","Mrs. Nomasonto Motaung","Name","Ms. Cathrine Kok"]
["Telephone number","0588139717","Telephone number","0588139717"]
["Cell number","0826407029","Cell number"]
["Fax number","0588133072","Fax number","0588133072"]
["E-mail address","sonto.malindi@webmail.co.za","E-mail address"]
[]
["Mayor/Executive Mayor:",null,"Secretary/PA to the Mayor/Executive Mayor:"]
["Name","Cllr. J.E. Sigasa","Name","Ms. Nhlapo Lindiwe"]
["Telephone number","0588139715","Telephone number","0588139715"]
["Cell number","0827875112","Cell number","0737070553"]
["Fax number","0588139715","Fax number","0588133072"]
["E-mail address","sigasaj@webmail.co.za","E-mail address","litsoako@mafubemunicipality.gov.za"]
[]
["Deputy Mayor/Executive Mayor:",null,"Secretary/PA to the Deputy Mayor/Executive Mayor:"]
["Name",null,"Name"]
["Telephone number",null,"Telephone number"]
["Cell number",null,"Cell number"]
["Fax number",null,"Fax number"]
["E-mail address",null,"E-mail address"]
[]
["D. MANAGEMENT LEADERSHIP"]
["Municipal Manager:",null,"Secretary/PA to the Municipal Manager:"]
["Name","Mr. N.A. Hlubi (Acting)","Name","Ms. Mando Mahloane"]
["Telephone number","0588139702","Telephone number","0588139702"]
["Cell number","0824967615","Cell number","0837251873"]
["Fax number","0588133072","Fax number","0588133072"]
["E-mail address","andrewh@mafubemunicipality.gov.za","E-mail address","lindiwe@mafube.gov.za"]
[]
["Chief Financial Officer",null,"Secretary/PA to the Chief Financial Officer"]
["Name","Mrs. Pinky Rametse (Acting)","Name"]
["Telephone number","0588139703","Telephone number"]
["Cell number",null,"Cell number"]
["Fax number","0588133072","Fax number"]
["E-mail address","pinkynthuping@gmail.com","E-mail address"]
[]
["Official responsible for submitting financial information"]
["Name","Mrs.Pinky Rametse (Acting)"]
["Telephone number","0588139700"]
["Cell number","0827591229"]
["Fax number","0588133072"]
["E-mail address","Pinkynthuping@gmail.com"]
["Official responsible for submitting financial information"]
["Name","Ms. Mokoena Mananky"]
["Telephone number","058 813 9700"]
["Cell number","082 431 9637"]
["Fax number","058 813 3072"]
["E-mail address","mananky@webmail.co.za"]
["Official responsible for submitting financial information"]
["Name"]
["Telephone number"]
["Cell number"]
["Fax number"]
["E-mail address"]

{"sheet":"A1-Sum","index":6,"n_rows":65,"n_cols":11,"rows_kept":65,"cut":false,"hidden":false,"merged":[[1,8,1,10],[1,4,1,7],[0,0,0,2]]}
[{"$f":"muni&\" - \"&Approve1","v":"FS205 Mafube - Table A1 Budget Summary"}]
[{"$f":"desc","v":"Description"},{"$f":"head1b","v":"2013/14"},{"$f":"head1A","v":"2014/15"},{"$f":"Head1","v":"2015/16"},{"$f":"Head2","v":"Current Year 2016/17"},null,null,null,{"$f":"Head3","v":"2017/18 Medium Term Revenue & Expenditure Framework"}]
["R thousands",{"$f":"Head5","v":"Audited Outcome"},{"$f":"Head5","v":"Audited Outcome"},{"$f":"Head5","v":"Audited Outcome"},{"$f":"Head6","v":"Original Budget"},{"$f":"Head7","v":"Adjusted Budget"},{"$f":"Head8","v":"Full Year Forecast"},{"$f":"Head5b","v":"Pre-audit outcome"},{"$f":"Head9","v":"Budget Year 2017/18"},{"$f":"Head10","v":"Budget Year +1 2018/19"},{"$f":"Head11","v":"Budget Year +2 2019/20"}]
["Financial Performance"]
["Property rates",{"$f":"'A4-FinPerf RE'!C5+'A4-FinPerf RE'!C6","v":19474278},{"$f":"'A4-FinPerf RE'!D5+'A4-FinPerf RE'!D6","v":21152561},{"$f":"'A4-FinPerf RE'!E5+'A4-FinPerf RE'!E6","v":22693193},{"$f":"'A4-FinPerf RE'!F5+'A4-FinPerf RE'!F6","v":27148891},{"$f":"'A4-FinPerf RE'!G5+'A4-FinPerf RE'!G6","v":27148891},{"$f":"'A4-FinPerf RE'!H5+'A4-FinPerf RE'!H6","v":27148891},{"$f":"'A4-FinPerf RE'!I5+'A4-FinPerf RE'!I6","v":0},{"$f":"'A4-FinPerf RE'!J5+'A4-FinPerf RE'!J6","v":28804972.990260001},{"$f":"'A4-FinPerf RE'!K5+'A4-FinPerf RE'!K6","v":30562076.3426659},{"$f":"'A4-FinPerf RE'!L5+'A4-FinPerf RE'!L6","v":32426362.9995685}]
["Service charges",{"$f":"SUM('A4-FinPerf RE'!C7:C11)","v":48865840},{"$f":"SUM('A4-FinPerf RE'!D7:D11)","v":61461665},{"$f":"SUM('A4-FinPerf RE'!E7:E11)","v":65138739},{"$f":"SUM('A4-FinPerf RE'!F7:F11)","v":53781740},{"$f":"SUM('A4-FinPerf RE'!G7:G11)","v":53781740},{"$f":"SUM('A4-FinPerf RE'!H7:H11)","v":53781740},{"$f":"SUM('A4-FinPerf RE'!I7:I11)","v":0},{"$f":"SUM('A4-FinPerf RE'!J7:J11)","v":57062426.628059998},{"$f":"SUM('A4-FinPerf RE'!K7:K11)","v":60543234.652371705},{"$f":"SUM('A4-FinPerf RE'!L7:L11)","v":64236371.966166392}]
["Investment revenue",{"$f":"'A4-FinPerf RE'!C13","v":187804},{"$f":"'A4-FinPerf RE'!D13","v":91143},{"$f":"'A4-FinPerf RE'!E13","v":236187},{"$f":"'A4-FinPerf RE'!F13","v":613295},{"$f":"'A4-FinPerf RE'!G13","v":613295},{"$f":"'A4-FinPerf RE'!H13","v":613295},{"$f":"'A4-FinPerf RE'!I13","v":0},{"$f":"'A4-FinPerf RE'!J13","v":214242.96280000001},{"$f":"'A4-FinPerf RE'!K13","v":227311.78353079999},{"$f":"'A4-FinPerf RE'!L13","v":241177.80232617899}]
["Transfers recognised - operational",{"$f":"'A4-FinPerf RE'!C19","v":75524459},{"$f":"'A4-FinPerf RE'!D19","v":83705052},{"$f":"'A4-FinPerf RE'!E19","v":86948674},{"$f":"'A4-FinPerf RE'!F19","v":81524000},{"$f":"'A4-FinPerf RE'!G19","v":87524000},{"$f":"'A4-FinPerf RE'!H19","v":81524000},{"$f":"'A4-FinPerf RE'!I19","v":0},{"$f":"'A4-FinPerf RE'!J19","v":83172000},{"$f":"'A4-FinPerf RE'!K19","v":90157000},{"$f":"'A4-FinPerf RE'!L19","v":95121000}]
["Other own revenue",{"$f":"'A4-FinPerf RE'!C12+'A4-FinPerf RE'!C14+'A4-FinPerf RE'!C15+'A4-FinPerf RE'!C16+'A4-FinPerf RE'!C17+'A4-FinPerf RE'!C18+'A4-FinPerf RE'!C20+'A4-FinPerf RE'!C21","v":13705174},{"$f":"'A4-FinPerf RE'!D12+'A4-FinPerf RE'!D14+'A4-FinPerf RE'!D15+'A4-FinPerf RE'!D16+'A4-FinPerf RE'!D17+'A4-FinPerf RE'!D18+'A4-FinPerf RE'!D20+'A4-FinPerf RE'!D21","v":24322373},{"$f":"'A4-FinPerf RE'!E12+'A4-FinPerf RE'!E14+'A4-FinPerf RE'!E15+'A4-FinPerf RE'!E16+'A4-FinPerf RE'!E17+'A4-FinPerf RE'!E18+'A4-FinPerf RE'!E20+'A4-FinPerf RE'!E21","v":30157974},{"$f":"'A4-FinPerf RE'!F12+'A4-FinPerf RE'!F14+'A4-FinPerf RE'!F15+'A4-FinPerf RE'!F16+'A4-FinPerf RE'!F17+'A4-FinPerf RE'!F18+'A4-FinPerf RE'!F20+'A4-FinPerf RE'!F21","v":32725070},{"$f":"'A4-FinPerf RE'!G12+'A4-FinPerf RE'!G14+'A4-FinPerf RE'!G15+'A4-FinPerf RE'!G16+'A4-FinPerf RE'!G17+'A4-FinPerf RE'!G18+'A4-FinPerf RE'!G20+'A4-FinPerf RE'!G21","v":32125070},{"$f":"'A4-FinPerf RE'!H12+'A4-FinPerf RE'!H14+'A4-FinPerf RE'!H15+'A4-FinPerf RE'!H16+'A4-FinPerf RE'!H17+'A4-FinPerf RE'!H18+'A4-FinPerf RE'!H20+'A4-FinPerf RE'!H21","v":32725070},{"$f":"'A4-FinPerf RE'!I12+'A4-FinPerf RE'!I14+'A4-FinPerf RE'!I15+'A4-FinPerf RE'!I16+'A4-FinPerf RE'!I17+'A4-FinPerf RE'!I18+'A4-FinPerf RE'!I20+'A4-FinPerf RE'!I21","v":0},{"$f":"'A4-FinPerf RE'!J12+'A4-FinPerf RE'!J14+'A4-FinPerf RE'!J15+'A4-FinPerf RE'!J16+'A4-FinPerf RE'!J17+'A4-FinPerf RE'!J18+'A4-FinPerf RE'!J20+'A4-FinPerf RE'!J21","v":33875662.327172801},{"$f":"'A4-FinPerf RE'!K12+'A4-FinPerf RE'!K14+'A4-FinPerf RE'!K15+'A4-FinPerf RE'!K16+'A4-FinPerf RE'!K17+'A4-FinPerf RE'!K18+'A4-FinPerf RE'!K20+'A4-FinPerf RE'!K21","v":35835089.850850075},{"$f":"'A4-FinPerf RE'!L12+'A4-FinPerf RE'!L14+'A4-FinPerf RE'!L15+'A4-FinPerf RE'!L16+'A4-FinPerf RE'!L17+'A4-FinPerf RE'!L18+'A4-FinPerf RE'!L20+'A4-FinPerf RE'!L21","v":37991972.6807748}]
[{"$f":"'A4-FinPerf RE'!A22","v":"Total Revenue (excluding capital transfers and contributions)"},{"$f":"SUM(B5:B9)","v":157757555},190732794,205174767,195792996,201192996,195792996,0,203129304.90829283,217324712.62941846,230016885.44883588]
["Employee costs",{"$f":"'A4-FinPerf RE'!C25","v":77962771},{"$f":"'A4-FinPerf RE'!D25","v":73311313},{"$f":"'A4-FinPerf RE'!E25","v":77102233},{"$f":"'A4-FinPerf RE'!F25","v":87529880.381401584},{"$f":"'A4-FinPerf RE'!G25","v":88725940.28140159},{"$f":"'A4-FinPerf RE'!H25","v":87529880.381401584},{"$f":"'A4-FinPerf RE'!I25","v":0},{"$f":"'A4-FinPerf RE'!J25","v":85790600.517562404},{"$f":"'A4-FinPerf RE'!K25","v":86648508.04273802},{"$f":"'A4-FinPerf RE'!L25","v":87514993.513165414}]
["Remuneration of councillors",{"$f":"'A4-FinPerf RE'!C26","v":5235182},{"$f":"'A4-FinPerf RE'!D26","v":4946053},{"$f":"'A4-FinPerf RE'!E26","v":5613522},{"$f":"'A4-FinPerf RE'!F26","v":5926016},{"$f":"'A4-FinPerf RE'!G26","v":5926016},{"$f":"'A4-FinPerf RE'!H26","v":5926016},{"$f":"'A4-FinPerf RE'!I26","v":0},{"$f":"'A4-FinPerf RE'!J26","v":5985276.6044000005},{"$f":"'A4-FinPerf RE'!K26","v":6045129.3704440007},{"$f":"'A4-FinPerf RE'!L26","v":6105580.6641484406}]
["Depreciation & asset impairment",{"$f":"'A4-FinPerf RE'!C28","v":137283347},{"$f":"'A4-FinPerf RE'!D28","v":37286363},{"$f":"'A4-FinPerf RE'!E28","v":38259177},{"$f":"'A4-FinPerf RE'!F28","v":1500000},{"$f":"'A4-FinPerf RE'!G28","v":1500000},{"$f":"'A4-FinPerf RE'!H28","v":1500000},{"$f":"'A4-FinPerf RE'!I28","v":0},{"$f":"'A4-FinPerf RE'!J28","v":38259177},{"$f":"'A4-FinPerf RE'!K28","v":38259177},{"$f":"'A4-FinPerf RE'!L28","v":38259177}]
["Finance charges",{"$f":"'A4-FinPerf RE'!C29","v":7849642},{"$f":"'A4-FinPerf RE'!D29","v":12101882},{"$f":"'A4-FinPerf RE'!E29","v":21271001},{"$f":"'A4-FinPerf RE'!F29","v":3211126},{"$f":"'A4-FinPerf RE'!G29","v":3211126},{"$f":"'A4-FinPerf RE'!H29","v":3211126},{"$f":"'A4-FinPerf RE'!I29","v":0},{"$f":"'A4-FinPerf RE'!J29","v":3298072},{"$f":"'A4-FinPerf RE'!K29","v":3499254.39},{"$f":"'A4-FinPerf RE'!L29","v":3712708.91}]
["Materials and bulk purchases",{"$f":"'A4-FinPerf RE'!C30+'A4-FinPerf RE'!C31","v":27714956},{"$f":"'A4-FinPerf RE'!D30+'A4-FinPerf RE'!D31","v":23768637},{"$f":"'A4-FinPerf RE'!E30+'A4-FinPerf RE'!E31","v":45946294},{"$f":"'A4-FinPerf RE'!F30+'A4-FinPerf RE'!F31","v":6000000},{"$f":"'A4-FinPerf RE'!G30+'A4-FinPerf RE'!G31","v":6000000},{"$f":"'A4-FinPerf RE'!H30+'A4-FinPerf RE'!H31","v":6000000},{"$f":"'A4-FinPerf RE'!I30+'A4-FinPerf RE'!I31","v":0},{"$f":"'A4-FinPerf RE'!J30+'A4-FinPerf RE'!J31","v":6000000},{"$f":"'A4-FinPerf RE'!K30+'A4-FinPerf RE'!K31","v":8122000},{"$f":"'A4-FinPerf RE'!L30+'A4-FinPerf RE'!L31","v":11416420}]
["Transfers and grants",{"$f":"'A4-FinPerf RE'!C33","v":6746501},{"$f":"'A4-FinPerf RE'!D33","v":3547907},{"$f":"'A4-FinPerf RE'!E33","v":9595124},{"$f":"'A4-FinPerf RE'!F33","v":5252545},{"$f":"'A4-FinPerf RE'!G33","v":5252545},{"$f":"'A4-FinPerf RE'!H33","v":5252545},{"$f":"'A4-FinPerf RE'!I33","v":0},{"$f":"'A4-FinPerf RE'!J33","v":10000000},{"$f":"'A4-FinPerf RE'!K33","v":10610000},{"$f":"'A4-FinPerf RE'!L33","v":11257210}]
["Other expenditure",{"$f":"'A4-FinPerf RE'!C27+'A4-FinPerf RE'!C32+'A4-FinPerf RE'!C34+'A4-FinPerf RE'!C35","v":75126205},{"$f":"'A4-FinPerf RE'!D27+'A4-FinPerf RE'!D32+'A4-FinPerf RE'!D34+'A4-FinPerf RE'!D35","v":109240045},{"$f":"'A4-FinPerf RE'!E27+'A4-FinPerf RE'!E32+'A4-FinPerf RE'!E34+'A4-FinPerf RE'!E35","v":70103677},{"$f":"'A4-FinPerf RE'!F27+'A4-FinPerf RE'!F32+'A4-FinPerf RE'!F34+'A4-FinPerf RE'!F35","v":76839664},{"$f":"'A4-FinPerf RE'!G27+'A4-FinPerf RE'!G32+'A4-FinPerf RE'!G34+'A4-FinPerf RE'!G35","v":80867000},{"$f":"'A4-FinPerf RE'!H27+'A4-FinPerf RE'!H32+'A4-FinPerf RE'!H34+'A4-FinPerf RE'!H35","v":76839664},{"$f":"'A4-FinPerf RE'!I27+'A4-FinPerf RE'!I32+'A4-FinPerf RE'!I34+'A4-FinPerf RE'!I35","v":0},{"$f":"'A4-FinPerf RE'!J27+'A4-FinPerf RE'!J32+'A4-FinPerf RE'!J34+'A4-FinPerf RE'!J35","v":64197882.796649605},{"$f":"'A4-FinPerf RE'!K27+'A4-FinPerf RE'!K32+'A4-FinPerf RE'!K34+'A4-FinPerf RE'!K35","v":69946784.533026055},{"$f":"'A4-FinPerf RE'!L27+'A4-FinPerf RE'!L32+'A4-FinPerf RE'!L34+'A4-FinPerf RE'!L35","v":76141835.762669355}]
[{"$f":"'A4-FinPerf RE'!A36","v":"Total Expenditure"},{"$f":"SUM(B11:B17)","v":337918604},{"$f":"SUM(C11:C17)","v":264202200},267891028,186259231.3814016,191482627.28140157,186259231.3814016,0,213531008.918612,223130853.33620805,234407925.84998322]
[{"$f":"'A4-FinPerf RE'!A38","v":"Surplus/(Deficit)"},{"$f":"B10-B18","v":-180161049},-73469406,-62716261,9533764.6185984015,9710368.7185984254,9533764.6185984015,0,-10401704.010319173,-5806140.706789583,-4391040.4011473358]
[{"$f":"'A4-FinPerf RE'!A39","v":"Transfers recognised - capital"},{"$f":"'A4-FinPerf RE'!C39","v":21319360},{"$f":"'A4-FinPerf RE'!D39","v":18508416},{"$f":"'A4-FinPerf RE'!E39","v":12635910},{"$f":"'A4-FinPerf RE'!F39","v":32422000},{"$f":"'A4-FinPerf RE'!G39","v":32422000},{"$f":"'A4-FinPerf RE'!H39","v":32422000},{"$f":"'A4-FinPerf RE'!I39","v":0},{"$f":"'A4-FinPerf RE'!J39","v":32080000},{"$f":"'A4-FinPerf RE'!K39","v":30874000},{"$f":"'A4-FinPerf RE'!L39","v":37037000}]
["Contributions recognised - capital & contributed assets",{"$f":"'A4-FinPerf RE'!C40+'A4-FinPerf RE'!C41","v":0},{"$f":"'A4-FinPerf RE'!D40+'A4-FinPerf RE'!D41","v":0},{"$f":"'A4-FinPerf RE'!E40+'A4-FinPerf RE'!E41","v":0},{"$f":"'A4-FinPerf RE'!F40+'A4-FinPerf RE'!F41","v":0},{"$f":"'A4-FinPerf RE'!G40+'A4-FinPerf RE'!G41","v":0},{"$f":"'A4-FinPerf RE'!H40+'A4-FinPerf RE'!H41","v":0},{"$f":"'A4-FinPerf RE'!I40+'A4-FinPerf RE'!I41","v":0},{"$f":"'A4-FinPerf RE'!J40+'A4-FinPerf RE'!J41","v":0},{"$f":"'A4-FinPerf RE'!K40+'A4-FinPerf RE'!K41","v":0},{"$f":"'A4-FinPerf RE'!L40+'A4-FinPerf RE'!L41","v":0}]
[{"$f":"'A4-FinPerf RE'!A42","v":"Surplus/(Deficit) after capital transfers & contributions"},{"$f":"B19+SUM(B20:B21)","v":-158841689},{"$f":"C19+SUM(C20:C21)","v":-54960990},-50080351,41955764.618598402,42132368.718598425,41955764.618598402,0,21678295.989680827,25067859.293210417,32645959.598852664]
[{"$f":"'A4-FinPerf RE'!A47","v":"Share of surplus/ (deficit) of associate"},{"$f":"'A4-FinPerf RE'!C47","v":0},{"$f":"'A4-FinPerf RE'!D47","v":0},{"$f":"'A4-FinPerf RE'!E47","v":0},{"$f":"'A4-FinPerf RE'!F47","v":0},{"$f":"'A4-FinPerf RE'!G47","v":0},{"$f":"'A4-FinPerf RE'!H47","v":0},{"$f":"'A4-FinPerf RE'!I47","v":0},{"$f":"'A4-FinPerf RE'!J47","v":0},{"$f":"'A4-FinPerf RE'!K47","v":0},{"$f":"'A4-FinPerf RE'!L47","v":0}]
[{"$f":"'A4-FinPerf RE'!A48","v":"Surplus/(Deficit) for the year"},{"$f":"B22+B23","v":-158841689},{"$f":"C22+C23","v":-54960990},-50080351,41955764.618598402,42132368.718598425,41955764.618598402,0,21678295.989680827,25067859.293210417,32645959.598852664]
[]
["Capital expenditure & funds sources"]
["Capital expenditure",{"$f":"'A5-Capex'!C63","v":25642024},{"$f":"'A5-Capex'!D63","v":14082654},{"$f":"'A5-Capex'!E63","v":9031915},{"$f":"'A5-Capex'!F63","v":41931635},{"$f":"'A5-Capex'!G63","v":41931635},{"$f":"'A5-Capex'!H63","v":41931635},{"$f":"'A5-Capex'!I63","v":0},{"$f":"'A5-Capex'!J63","v":33091912.760000002},{"$f":"'A5-Capex'!K63","v":31995991.890000001},{"$f":"'A5-Capex'!L63","v":38276269.364027761}]
["Transfers recognised - capital",{"$f":"'A5-Capex'!C70","v":23341792},{"$f":"'A5-Capex'!D70","v":12656687},{"$f":"'A5-Capex'!E70","v":8051791},{"$f":"'A5-Capex'!F70","v":31941635},{"$f":"'A5-Capex'!G70","v":31941635},{"$f":"'A5-Capex'!H70","v":31941635},{"$f":"'A5-Capex'!I70","v":0},{"$f":"'A5-Capex'!J70","v":31091912.760000002},{"$f":"'A5-Capex'!K70","v":29873991.890000001},{"$f":"'A5-Capex'!L70","v":36024827.364027761}]
[{"$f":"'A5-Capex'!A71","v":"Public contributions & donations"},{"$f":"'A5-Capex'!C71","v":0},{"$f":"'A5-Capex'!D71","v":0},{"$f":"'A5-Capex'!E71","v":0},{"$f":"'A5-Capex'!F71","v":0},{"$f":"'A5-Capex'!G71","v":0},{"$f":"'A5-Capex'!H71","v":0},{"$f":"'A5-Capex'!I71","v":0},{"$f":"'A5-Capex'!J71","v":0},{"$f":"'A5-Capex'!K71","v":0},{"$f":"'A5-Capex'!L71","v":0}]
[{"$f":"'A5-Capex'!A72","v":"Borrowing"},{"$f":"'A5-Capex'!C72","v":0},{"$f":"'A5-Capex'!D72","v":0},{"$f":"'A5-Capex'!E72","v":0},{"$f":"'A5-Capex'!F72","v":0},{"$f":"'A5-Capex'!G72","v":0},{"$f":"'A5-Capex'!H72","v":0},{"$f":"'A5-Capex'!I72","v":0},{"$f":"'A5-Capex'!J72","v":0},{"$f":"'A5-Capex'!K72","v":0},{"$f":"'A5-Capex'!L72","v":0}]
[{"$f":"'A5-Capex'!A73","v":"Internally generated funds"},{"$f":"'A5-Capex'!C73","v":2300232},{"$f":"'A5-Capex'!D73","v":1425967},{"$f":"'A5-Capex'!E73","v":980124},{"$f":"'A5-Capex'!F73","v":9990000},{"$f":"'A5-Capex'!G73","v":9990000},{"$f":"'A5-Capex'!H73","v":9990000},{"$f":"'A5-Capex'!I73","v":0},{"$f":"'A5-Capex'!J73","v":2000000},{"$f":"'A5-Capex'!K73","v":2122000},{"$f":"'A5-Capex'!L73","v":2251442}]
["Total sources of capital funds",{"$f":"SUM(B28:B31)","v":25642024},14082654,9031915,41931635,41931635,41931635,0,33091912.760000002,31995991.890000001,38276269.364027761]
[]
["Financial position"]
[{"$f":"'A6-FinPos'!A12","v":"Total current assets"},{"$f":"'A6-FinPos'!C12","v":43748068},{"$f":"'A6-FinPos'!D12","v":76348630},{"$f":"'A6-FinPos'!E12","v":144434319},{"$f":"'A6-FinPos'!F12","v":76348630},{"$f":"'A6-FinPos'!G12","v":74315630},{"$f":"'A6-FinPos'!H12","v":74315630},{"$f":"'A6-FinPos'!I12","v":11438686},{"$f":"'A6-FinPos'!J12","v":75615630},{"$f":"'A6-FinPos'!K12","v":75615630},{"$f":"'A6-FinPos'!L12","v":75615630}]
[{"$f":"'A6-FinPos'!A24","v":"Total non current assets"},{"$f":"'A6-FinPos'!C24","v":1207542736},{"$f":"'A6-FinPos'!D24","v":776827116},{"$f":"'A6-FinPos'!E24","v":747598426},{"$f":"'A6-FinPos'!F24","v":1099119093},{"$f":"'A6-FinPos'!G24","v":1099119093},{"$f":"'A6-FinPos'!H24","v":1099118824},{"$f":"'A6-FinPos'!I24","v":-50000},{"$f":"'A6-FinPos'!J24","v":1099118824},{"$f":"'A6-FinPos'!K24","v":1099118824},{"$f":"'A6-FinPos'!L24","v":1099118824}]
[{"$f":"'A6-FinPos'!A34","v":"Total current liabilities"},{"$f":"'A6-FinPos'!C34","v":218512581},{"$f":"'A6-FinPos'!D34","v":295214101},{"$f":"'A6-FinPos'!E34","v":376464599},{"$f":"'A6-FinPos'!F34","v":60347381},{"$f":"'A6-FinPos'!G34","v":60347381},{"$f":"'A6-FinPos'!H34","v":60347381},{"$f":"'A6-FinPos'!I34","v":-10712082},{"$f":"'A6-FinPos'!J34","v":60347381},{"$f":"'A6-FinPos'!K34","v":60347381},{"$f":"'A6-FinPos'!L34","v":60347381}]
[{"$f":"'A6-FinPos'!A39","v":"Total non current liabilities"},{"$f":"'A6-FinPos'!C39","v":25835744},{"$f":"'A6-FinPos'!D39","v":25534352},{"$f":"'A6-FinPos'!E39","v":24896943},{"$f":"'A6-FinPos'!F39","v":16192432},{"$f":"'A6-FinPos'!G39","v":16192432},{"$f":"'A6-FinPos'!H39","v":16192432},{"$f":"'A6-FinPos'!I39","v":152986},{"$f":"'A6-FinPos'!J39","v":16192432},{"$f":"'A6-FinPos'!K39","v":16192432},{"$f":"'A6-FinPos'!L39","v":16192432}]
["Community wealth/Equity",{"$f":"'A6-FinPos'!C48","v":1006942479},{"$f":"'A6-FinPos'!D48","v":532426863},{"$f":"'A6-FinPos'!E48","v":490671094},{"$f":"'A6-FinPos'!F48","v":1098927641},{"$f":"'A6-FinPos'!G48","v":1096894641},{"$f":"'A6-FinPos'!H48","v":1096894641},{"$f":"'A6-FinPos'!I48","v":21947782},{"$f":"'A6-FinPos'!J48","v":1098194641},{"$f":"'A6-FinPos'!K48","v":1098194641},{"$f":"'A6-FinPos'!L48","v":1098194641}]
[]
["Cash flows"]
["Net cash from (used) operating",{"$f":"'A7-CFlow'!C17","v":35847119},{"$f":"'A7-CFlow'!D17","v":28436976},{"$f":"'A7-CFlow'!E17","v":188197},{"$f":"'A7-CFlow'!F17","v":12375662},{"$f":"'A7-CFlow'!G17","v":41833305},{"$f":"'A7-CFlow'!H17","v":41833305},{"$f":"'A7-CFlow'!I17","v":-96232939},{"$f":"'A7-CFlow'!J17","v":26669466.600430489},{"$f":"'A7-CFlow'!K17","v":28188832.056215912},{"$f":"'A7-CFlow'!L17","v":33623502.373401433}]
["Net cash from (used) investing",{"$f":"'A7-CFlow'!C27","v":-29396503},{"$f":"'A7-CFlow'!D27","v":-23343427},{"$f":"'A7-CFlow'!E27","v":-87182},{"$f":"'A7-CFlow'!F27","v":-41931635},{"$f":"'A7-CFlow'!G27","v":-41931635},{"$f":"'A7-CFlow'!H27","v":-41931635},{"$f":"'A7-CFlow'!I27","v":96534307},{"$f":"'A7-CFlow'!J27","v":-33091912.757599995},{"$f":"'A7-CFlow'!K27","v":-31995991.885175999},{"$f":"'A7-CFlow'!L27","v":-38276269.364027761}]
["Net cash from (used) financing",{"$f":"'A7-CFlow'!C36","v":-5569111},{"$f":"'A7-CFlow'!D36","v":-3145152},{"$f":"'A7-CFlow'!E36","v":-529097},{"$f":"'A7-CFlow'!F36","v":0},{"$f":"'A7-CFlow'!G36","v":300000},{"$f":"'A7-CFlow'!H36","v":300000},{"$f":"'A7-CFlow'!I36","v":-150000},{"$f":"'A7-CFlow'!J36","v":0},{"$f":"'A7-CFlow'!K36","v":0},{"$f":"'A7-CFlow'!L36","v":0}]
[{"$f":"LEFT('A7-CFlow'!A40,37)","v":"Cash/cash equivalents at the year end"},{"$f":"'A7-CFlow'!C40","v":3580602},{"$f":"'A7-CFlow'!D40","v":2012764},{"$f":"'A7-CFlow'!E40","v":191846},{"$f":"'A7-CFlow'!F40","v":-29555973},{"$f":"'A7-CFlow'!G40","v":201670},{"$f":"'A7-CFlow'!H40","v":201670},{"$f":"'A7-CFlow'!I40","v":240445},{"$f":"'A7-CFlow'!J40","v":-6422446.157169506},{"$f":"'A7-CFlow'!K40","v":-10229605.986129593},{"$f":"'A7-CFlow'!L40","v":-14882372.976755921}]
[]
["Cash backing/surplus reconciliation"]
[{"$f":"'A8-ResRecon'!A4","v":"Cash and investments available"},{"$f":"'A8-ResRecon'!C8","v":95782},{"$f":"'A8-ResRecon'!D8","v":619928},{"$f":"'A8-ResRecon'!E8","v":635344},{"$f":"'A8-ResRecon'!F8","v":619928},{"$f":"'A8-ResRecon'!G8","v":619928},{"$f":"'A8-ResRecon'!H8","v":619928},{"$f":"'A8-ResRecon'!I8","v":4506044},{"$f":"'A8-ResRecon'!J8","v":-149858},{"$f":"'A8-ResRecon'!K8","v":-149858},{"$f":"'A8-ResRecon'!L8","v":-149858}]
[{"$f":"'A8-ResRecon'!A10","v":"Application of cash and investments"},{"$f":"'A8-ResRecon'!C18","v":199925494},{"$f":"'A8-ResRecon'!D18","v":263458456},{"$f":"'A8-ResRecon'!E18","v":264827982},{"$f":"'A8-ResRecon'!F18","v":21343059},{"$f":"'A8-ResRecon'!G18","v":2819059},{"$f":"'A8-ResRecon'!H18","v":3123059},{"$f":"'A8-ResRecon'!I18","v":-10640943},{"$f":"'A8-ResRecon'!J18","v":29756059},{"$f":"'A8-ResRecon'!K18","v":29779059},{"$f":"'A8-ResRecon'!L18","v":29773059}]
["Balance - surplus (shortfall)",{"$f":"B48-B49","v":-199829712},{"$f":"C48-C49","v":-262838528},-264192638,-20723131,-2199131,-2503131,15146987,-29905917,-29928917,-29922917]
[]
["Asset management"]
["Asset register summary (WDV)",{"$f":"'A9-Asset'!C65","v":1202238828},{"$f":"'A9-Asset'!D65","v":88435862},{"$f":"'A9-Asset'!E65","v":82635039},{"$f":"'A9-Asset'!F65","v":1151955255},{"$f":"'A9-Asset'!G65","v":1151955072},{"$f":"'A9-Asset'!H65","v":54662391},{"$f":"'A9-Asset'!I65","v":1151955072},{"$f":"'A9-Asset'!I65","v":1151955072},{"$f":"'A9-Asset'!J65","v":1151955072},{"$f":"'A9-Asset'!K65","v":1151955072}]
[{"$f":"'A9-Asset'!A68","v":"Depreciation & asset impairment"},{"$f":"'A9-Asset'!C68","v":137283347},{"$f":"'A9-Asset'!D68","v":37286363},{"$f":"'A9-Asset'!E68","v":38259177},{"$f":"'A9-Asset'!F68","v":1500000},{"$f":"'A9-Asset'!G68","v":1500000},{"$f":"'A9-Asset'!H68","v":1500000},{"$f":"'A9-Asset'!I68","v":38259177},{"$f":"'A9-Asset'!I68","v":38259177},{"$f":"'A9-Asset'!J68","v":38259177},{"$f":"'A9-Asset'!K68","v":38259177}]
["Renewal of Existing Assets",{"$f":"'A9-Asset'!C20","v":0},{"$f":"'A9-Asset'!D20","v":0},{"$f":"'A9-Asset'!E20","v":0},{"$f":"'A9-Asset'!F20","v":2326909},{"$f":"'A9-Asset'!G20","v":2326909},{"$f":"'A9-Asset'!H20","v":2326909},{"$f":"'A9-Asset'!H20","v":2326909},{"$f":"'A9-Asset'!I20","v":7224070.7199999997},{"$f":"'A9-Asset'!J20","v":1074330},{"$f":"'A9-Asset'!K20","v":1126665}]
["Repairs and Maintenance",{"$f":"'A9-Asset'!C69","v":11206908},{"$f":"'A9-Asset'!D69","v":32876183},{"$f":"'A9-Asset'!E69","v":0},{"$f":"'A9-Asset'!F69","v":13885000},{"$f":"'A9-Asset'!G69","v":13885000},{"$f":"'A9-Asset'!H69","v":13885000},{"$f":"'A9-Asset'!I69","v":18240509.91},{"$f":"'A9-Asset'!I69","v":18240509.91},{"$f":"'A9-Asset'!J69","v":20718382.460000001},{"$f":"'A9-Asset'!K69","v":23950789.119999997}]
[]
["Free services"]
["Cost of Free Basic Services provided",{"$f":"'A10-SerDel'!C60","v":0},{"$f":"'A10-SerDel'!D60","v":0},{"$f":"'A10-SerDel'!E60","v":0},{"$f":"'A10-SerDel'!F60","v":17200},{"$f":"'A10-SerDel'!G60","v":17200},{"$f":"'A10-SerDel'!H60","v":17200},{"$f":"'A10-SerDel'!I60","v":19200},{"$f":"'A10-SerDel'!I60","v":19200},{"$f":"'A10-SerDel'!J60","v":19600},{"$f":"'A10-SerDel'!K60","v":19600}]
["Revenue cost of free services provided",{"$f":"'A10-SerDel'!C79","v":0},{"$f":"'A10-SerDel'!D79","v":0},{"$f":"'A10-SerDel'!E79","v":0},{"$f":"'A10-SerDel'!F79","v":0},{"$f":"'A10-SerDel'!G79","v":0},{"$f":"'A10-SerDel'!H79","v":0},{"$f":"'A10-SerDel'!I79","v":0},{"$f":"'A10-SerDel'!I79","v":0},{"$f":"'A10-SerDel'!J79","v":0},{"$f":"'A10-SerDel'!K79","v":0}]
["Households below minimum service level"]
[{"$f":"'A10-SerDel'!A5","v":"Water:"},{"$f":"'A10-SerDel'!C14","v":0},{"$f":"'A10-SerDel'!D14","v":0},{"$f":"'A10-SerDel'!E14","v":1300},{"$f":"'A10-SerDel'!F14","v":600},{"$f":"'A10-SerDel'!G14","v":1300},{"$f":"'A10-SerDel'!H14","v":1300},{"$f":"'A10-SerDel'!I14","v":600},{"$f":"'A10-SerDel'!I14","v":600},{"$f":"'A10-SerDel'!J14","v":600},{"$f":"'A10-SerDel'!K14","v":600}]
[{"$f":"'A10-SerDel'!A16","v":"Sanitation/sewerage:"},{"$f":"'A10-SerDel'!C26","v":0},{"$f":"'A10-SerDel'!D26","v":0},{"$f":"'A10-SerDel'!E26","v":0},{"$f":"'A10-SerDel'!F26","v":0},{"$f":"'A10-SerDel'!G26","v":0},{"$f":"'A10-SerDel'!H26","v":0},{"$f":"'A10-SerDel'!I26","v":0},{"$f":"'A10-SerDel'!I26","v":0},{"$f":"'A10-SerDel'!J26","v":0},{"$f":"'A10-SerDel'!K26","v":0}]
[{"$f":"'A10-SerDel'!A28","v":"Energy:"},{"$f":"'A10-SerDel'!C35","v":0},{"$f":"'A10-SerDel'!D35","v":0},{"$f":"'A10-SerDel'!E35","v":2860},{"$f":"'A10-SerDel'!F35","v":1430},{"$f":"'A10-SerDel'!G35","v":1430},{"$f":"'A10-SerDel'!H35","v":1430},{"$f":"'A10-SerDel'!I35","v":2000},{"$f":"'A10-SerDel'!I35","v":2000},{"$f":"'A10-SerDel'!J35","v":2000},{"$f":"'A10-SerDel'!K35","v":2000}]
[{"$f":"'A10-SerDel'!A37","v":"Refuse:"},{"$f":"'A10-SerDel'!C45","v":0},{"$f":"'A10-SerDel'!D45","v":0},{"$f":"'A10-SerDel'!E45","v":4000},{"$f":"'A10-SerDel'!F45","v":6000},{"$f":"'A10-SerDel'!G45","v":4000},{"$f":"'A10-SerDel'!H45","v":4000},{"$f":"'A10-SerDel'!I45","v":4500},{"$f":"'A10-SerDel'!I45","v":4500},{"$f":"'A10-SerDel'!J45","v":4500},{"$f":"'A10-SerDel'!K45","v":5000}]

{"sheet":"A2-FinPerf SC","index":7,"n_rows":58,"n_cols":11,"rows_kept":58,"cut":false,"hidden":false,"merged":[[53,0,53,10],[1,5,1,7],[1,8,1,10]]}
[{"$f":"muni&\" - \"&Approve3","v":"FS205 Mafube - Table A2 Budgeted Financial Performance (revenue and expenditure by standard classification)"}]
[{"$f":"\"Standard Classification \"&desc","v":"Standard Classification Description"},{"$f":"head27","v":"Ref"},{"$f":"head1b","v":"2013/14"},{"$f":"head1A","v":"2014/15"},{"$f":"Head1","v":"2015/16"},{"$f":"Head2","v":"Current Year 2016/17"},null,null,{"$f":"Head3","v":"2017/18 Medium Term Revenue & Expenditure Framework"}]
["R thousand",1,{"$f":"Head5","v":"Audited Outcome"},{"$f":"Head5","v":"Audited Outcome"},{"$f":"Head5","v":"Audited Outcome"},{"$f":"Head6","v":"Original Budget"},{"$f":"Head7","v":"Adjusted Budget"},{"$f":"Head8","v":"Full Year Forecast"},{"$f":"Head9","v":"Budget Year 2017/18"},{"$f":"Head10","v":"Budget Year +1 2018/19"},{"$f":"Head11","v":"Budget Year +2 2019/20"}]
["Revenue - Standard"]
["Governance and administration",null,{"$f":"SUM(C6:C8)","v":110166887},{"$f":"SUM(D6:D8)","v":128964469},141428114,142011255.59999999,147411255.59999999,0,146066878.28,156781478,165780513]
["Executive and council",null,{"$f":"A2A!C6","v":0},{"$f":"A2A!D6","v":0},{"$f":"A2A!E6","v":0},{"$f":"A2A!F6","v":0},{"$f":"A2A!G6","v":0},{"$f":"A2A!H6","v":0},{"$f":"A2A!I6","v":0},{"$f":"A2A!J6","v":0},{"$f":"A2A!K6","v":0}]
["Budget and treasury office",null,{"$f":"A2A!C9","v":110166887},{"$f":"A2A!D9","v":128964469},{"$f":"A2A!E9","v":141428114},{"$f":"A2A!F9","v":142011255.59999999},{"$f":"A2A!G9","v":147411255.59999999},{"$f":"A2A!H9","v":0},{"$f":"A2A!I9","v":146066878.28},{"$f":"A2A!J9","v":156781478},{"$f":"A2A!K9","v":165780513}]
["Corporate services",null,{"$f":"A2A!C10","v":0},{"$f":"A2A!D10","v":0},{"$f":"A2A!E10","v":0},{"$f":"A2A!F10","v":0},{"$f":"A2A!G10","v":0},{"$f":"A2A!H10","v":0},{"$f":"A2A!I10","v":0},{"$f":"A2A!J10","v":0},{"$f":"A2A!K10","v":0}]
["Community and public safety",null,{"$f":"SUM(C10:C14)","v":0},{"$f":"SUM(D10:D14)","v":688651},0,0,0,0,0,0,0]
["Community and social services",null,{"$f":"A2A!C16","v":0},{"$f":"A2A!D16","v":688651},{"$f":"A2A!E16","v":0},{"$f":"A2A!F16","v":0},{"$f":"A2A!G16","v":0},{"$f":"A2A!H16","v":0},{"$f":"A2A!I16","v":0},{"$f":"A2A!J16","v":0},{"$f":"A2A!K16","v":0}]
["Sport and recreation",null,{"$f":"A2A!C25","v":0},{"$f":"A2A!D25","v":0},{"$f":"A2A!E25","v":0},{"$f":"A2A!F25","v":0},{"$f":"A2A!G25","v":0},{"$f":"A2A!H25","v":0},{"$f":"A2A!I25","v":0},{"$f":"A2A!J25","v":0},{"$f":"A2A!K25","v":0}]
["Public safety",null,{"$f":"A2A!C26","v":0},{"$f":"A2A!D26","v":0},{"$f":"A2A!E26","v":0},{"$f":"A2A!F26","v":0},{"$f":"A2A!G26","v":0},{"$f":"A2A!H26","v":0},{"$f":"A2A!I26","v":0},{"$f":"A2A!J26","v":0},{"$f":"A2A!K26","v":0}]
["Housing",null,{"$f":"A2A!C32","v":0},{"$f":"A2A!D32","v":0},{"$f":"A2A!E32","v":0},{"$f":"A2A!F32","v":0},{"$f":"A2A!G32","v":0},{"$f":"A2A!H32","v":0},{"$f":"A2A!I32","v":0},{"$f":"A2A!J32","v":0},{"$f":"A2A!K32","v":0}]
["Health",null,{"$f":"A2A!C33","v":0},{"$f":"A2A!D33","v":0},{"$f":"A2A!E33","v":0},{"$f":"A2A!F33","v":0},{"$f":"A2A!G33","v":0},{"$f":"A2A!H33","v":0},{"$f":"A2A!I33","v":0},{"$f":"A2A!J33","v":0},{"$f":"A2A!K33","v":0}]
["Economic and environmental services",null,{"$f":"SUM(C16:C18)","v":0},{"$f":"SUM(D16:D18)","v":144746},0,0,0,0,0,0,0]
["Planning and development",null,{"$f":"A2A!C38","v":0},{"$f":"A2A!D38","v":134610},{"$f":"A2A!E38","v":0},{"$f":"A2A!F38","v":0},{"$f":"A2A!G38","v":0},{"$f":"A2A!H38","v":0},{"$f":"A2A!I38","v":0},{"$f":"A2A!J38","v":0},{"$f":"A2A!K38","v":0}]
["Road transport",null,{"$f":"A2A!C42","v":0},{"$f":"A2A!D42","v":10136},{"$f":"A2A!E42","v":0},{"$f":"A2A!F42","v":0},{"$f":"A2A!G42","v":0},{"$f":"A2A!H42","v":0},{"$f":"A2A!I42","v":0},{"$f":"A2A!J42","v":0},{"$f":"A2A!K42","v":0}]
["Environmental protection",null,{"$f":"A2A!C48","v":0},{"$f":"A2A!D48","v":0},{"$f":"A2A!E48","v":0},{"$f":"A2A!F48","v":0},{"$f":"A2A!G48","v":0},{"$f":"A2A!H48","v":0},{"$f":"A2A!I48","v":0},{"$f":"A2A!J48","v":0},{"$f":"A2A!K48","v":0}]
["Trading services",null,{"$f":"SUM(C20:C23)","v":53962745},{"$f":"SUM(D20:D23)","v":79443344},76382563,64781739,64781739,0,62062426.628059998,{"$f":"SUM(J20:J23)","v":67543234.652371705},76236371.966166407]
["Electricity",null,{"$f":"A2A!C53","v":6269791},{"$f":"A2A!D53","v":7404258},{"$f":"A2A!E53","v":9367654},{"$f":"A2A!F53","v":11000000},{"$f":"A2A!G53","v":11000000},{"$f":"A2A!H53","v":0},{"$f":"A2A!I53","v":5000000},{"$f":"A2A!J53","v":7000000},{"$f":"A2A!K53","v":12000000}]
["Water",null,{"$f":"A2A!C56","v":18518134},{"$f":"A2A!D56","v":43217236},{"$f":"A2A!E56","v":37125741},{"$f":"A2A!F56","v":23098759},{"$f":"A2A!G56","v":23098759},{"$f":"A2A!H56","v":0},{"$f":"A2A!I56","v":24507784.338780001},{"$f":"A2A!J56","v":26002759.183445599},{"$f":"A2A!K56","v":27588927.4936358}]
["Waste water management",null,{"$f":"A2A!C59","v":15312749},{"$f":"A2A!D59","v":16696403},{"$f":"A2A!E59","v":17305717},{"$f":"A2A!F59","v":17776153},{"$f":"A2A!G59","v":17776153},{"$f":"A2A!H59","v":0},{"$f":"A2A!I59","v":18860498.714960001},{"$f":"A2A!J59","v":20010989.136572599},{"$f":"A2A!K59","v":21231659.4739035}]
["Waste management",null,{"$f":"A2A!C63","v":13862071},{"$f":"A2A!D63","v":12125447},{"$f":"A2A!E63","v":12583451},{"$f":"A2A!F63","v":12906827},{"$f":"A2A!G63","v":12906827},{"$f":"A2A!H63","v":0},{"$f":"A2A!I63","v":13694143.57432},{"$f":"A2A!J63","v":14529486.332353501},{"$f":"A2A!K63","v":15415784.9986271}]
["Other",4,{"$f":"A2A!C65","v":14947283},{"$f":"A2A!D65","v":0},{"$f":"A2A!E65","v":0},{"$f":"A2A!F65","v":21422000},{"$f":"A2A!G65","v":21422000},{"$f":"A2A!H65","v":0},{"$f":"A2A!I65","v":27080000},{"$f":"A2A!J65","v":23874000},{"$f":"A2A!K65","v":25037000}]
[{"$f":"\"Total \"&A4","v":"Total Revenue - Standard"},2,{"$f":"C5+C9+C15+C19+C24","v":179076915},{"$f":"D5+D9+D15+D19+D24","v":209241210},{"$f":"E5+E9+E15+E19+E24","v":217810677},228214994.59999999,233614994.59999999,0,{"$f":"I5+I9+I15+I19+I24","v":235209304.90806001},248198712.6523717,267053884.96616641]
[]
["Expenditure - Standard"]
[{"$f":"A5","v":"Governance and administration"},null,{"$f":"SUM(C29:C31)","v":292257265},{"$f":"SUM(D29:D31)","v":236363150},212236111,134780028.32000002,133316000,0,164340703.646312,168604972.01077512,172885119.48786089]
[{"$f":"A6","v":"Executive and council"},null,{"$f":"A2A!C76","v":8533570},{"$f":"A2A!D76","v":58411424},{"$f":"A2A!E76","v":44320779},{"$f":"A2A!F76","v":72115662.640000001},{"$f":"A2A!G76","v":66775000},{"$f":"A2A!H76","v":0},{"$f":"A2A!I76","v":62755315.961411998},{"$f":"A2A!J76","v":64128644.121026114},{"$f":"A2A!K76","v":65351223.627236381}]
["Budget and treasury office",null,{"$f":"A2A!C79","v":198189107},{"$f":"A2A!D79","v":99589241},{"$f":"A2A!E79","v":82117563},{"$f":"A2A!F79","v":29195828.350000001},{"$f":"A2A!G79","v":27946000},{"$f":"A2A!H79","v":0},{"$f":"A2A!I79","v":70477220.988499999},{"$f":"A2A!J79","v":72022034.526384994},{"$f":"A2A!K79","v":73656876.818626851}]
["Corporate services",null,{"$f":"A2A!C80","v":85534588},{"$f":"A2A!D80","v":78362485},{"$f":"A2A!E80","v":85797769},{"$f":"A2A!F80","v":33468537.330000002},{"$f":"A2A!G80","v":38595000},{"$f":"A2A!H80","v":0},{"$f":"A2A!I80","v":31108166.696399998},{"$f":"A2A!J80","v":32454293.363364},{"$f":"A2A!K80","v":33877019.041997641}]
["Community and public safety",null,{"$f":"SUM(C33:C37)","v":17326},{"$f":"SUM(D33:D37)","v":756369},6818067,13853133.959999999,12588000,0,11232600.1482,11503281.149682,11786328.61617882]
["Community and social services",null,{"$f":"A2A!C86","v":0},{"$f":"A2A!D86","v":734536},{"$f":"A2A!E86","v":6818067},{"$f":"A2A!F86","v":13853133.959999999},{"$f":"A2A!G86","v":12588000},{"$f":"A2A!H86","v":0},{"$f":"A2A!I86","v":11232600.1482},{"$f":"A2A!J86","v":11503281.149682},{"$f":"A2A!K86","v":11786328.61617882}]
["Sport and recreation",null,{"$f":"A2A!C95","v":0},{"$f":"A2A!D95","v":0},{"$f":"A2A!E95","v":0},{"$f":"A2A!F95","v":0},{"$f":"A2A!G95","v":0},{"$f":"A2A!H95","v":0},{"$f":"A2A!I95","v":0},{"$f":"A2A!J95","v":0},{"$f":"A2A!K95","v":0}]
["Public safety",null,{"$f":"A2A!C96","v":17326},{"$f":"A2A!D96","v":21833},{"$f":"A2A!E96","v":0},{"$f":"A2A!F96","v":0},{"$f":"A2A!G96","v":0},{"$f":"A2A!H96","v":0},{"$f":"A2A!I96","v":0},{"$f":"A2A!J96","v":0},{"$f":"A2A!K96","v":0}]
["Housing",null,{"$f":"A2A!C102","v":0},{"$f":"A2A!D102","v":0},{"$f":"A2A!E102","v":0},{"$f":"A2A!F102","v":0},{"$f":"A2A!G102","v":0},{"$f":"A2A!H102","v":0},{"$f":"A2A!I102","v":0},{"$f":"A2A!J102","v":0},{"$f":"A2A!K102","v":0}]
["Health",null,{"$f":"A2A!C103","v":0},{"$f":"A2A!D103","v":0},{"$f":"A2A!E103","v":0},{"$f":"A2A!F103","v":0},{"$f":"A2A!G103","v":0},{"$f":"A2A!H103","v":0},{"$f":"A2A!I103","v":0},{"$f":"A2A!J103","v":0},{"$f":"A2A!K103","v":0}]
["Economic and environmental services",null,{"$f":"SUM(C39:C41)","v":0},{"$f":"SUM(D39:D41)","v":0},0,4635533.9800000004,4724000,0,4911988.8201000001,6671108.7083010003,8984366.4653840102]
["Planning and development",null,{"$f":"A2A!C108","v":0},{"$f":"A2A!D108","v":0},{"$f":"A2A!E108","v":0},{"$f":"A2A!F108","v":0},{"$f":"A2A!G108","v":0},{"$f":"A2A!H108","v":0},{"$f":"A2A!I108","v":0},{"$f":"A2A!J108","v":0},{"$f":"A2A!K108","v":0}]
["Road transport",null,{"$f":"A2A!C112","v":0},{"$f":"A2A!D112","v":0},{"$f":"A2A!E112","v":0},{"$f":"A2A!F112","v":4635533.9800000004},{"$f":"A2A!G112","v":4724000},{"$f":"A2A!H112","v":0},{"$f":"A2A!I112","v":4911988.8201000001},{"$f":"A2A!J112","v":6671108.7083010003},{"$f":"A2A!K112","v":8984366.4653840102}]
["Environmental protection",null,{"$f":"A2A!C118","v":0},{"$f":"A2A!D118","v":0},{"$f":"A2A!E118","v":0},{"$f":"A2A!F118","v":0},{"$f":"A2A!G118","v":0},{"$f":"A2A!H118","v":0},{"$f":"A2A!I118","v":0},{"$f":"A2A!J118","v":0},{"$f":"A2A!K118","v":0}]
["Trading services",null,{"$f":"SUM(C43:C46)","v":29906165},{"$f":"SUM(D43:D46)","v":27082681},48836895,{"$f":"SUM(F43:F46)","v":32010169.030000001},39854000,0,31807629.0616,35101483.352625996,{"$f":"SUM(K43:K46)","v":39474688.644587271}]
["Electricity",null,{"$f":"A2A!C123","v":17199992},{"$f":"A2A!D123","v":6729008},{"$f":"A2A!E123","v":10962325},{"$f":"A2A!F123","v":7494938.2400000002},{"$f":"A2A!G123","v":7724000},{"$f":"A2A!H123","v":0},{"$f":"A2A!I123","v":7685341.0805000002},{"$f":"A2A!J123","v":9885494.4913050011},{"$f":"A2A!K123","v":11937082.73621805}]
["Water",null,{"$f":"A2A!C126","v":12706173},{"$f":"A2A!D126","v":20353673},{"$f":"A2A!E126","v":37874570},{"$f":"A2A!F126","v":24515230.789999999},{"$f":"A2A!G126","v":32130000},{"$f":"A2A!H126","v":0},{"$f":"A2A!I126","v":24122287.9811},{"$f":"A2A!J126","v":25215988.861320999},{"$f":"A2A!K126","v":27537605.908369221}]
["Waste water management",null,{"$f":"A2A!C129","v":0},{"$f":"A2A!D129","v":0},{"$f":"A2A!E129","v":0},{"$f":"A2A!F129","v":0},{"$f":"A2A!G129","v":0},{"$f":"A2A!H129","v":0},{"$f":"A2A!I129","v":0},{"$f":"A2A!J129","v":0},{"$f":"A2A!K129","v":0}]
["Waste management",null,{"$f":"A2A!C133","v":0},{"$f":"A2A!D133","v":0},{"$f":"A2A!E133","v":0},{"$f":"A2A!F133","v":0},{"$f":"A2A!G133","v":0},{"$f":"A2A!H133","v":0},{"$f":"A2A!I133","v":0},{"$f":"A2A!J133","v":0},{"$f":"A2A!K133","v":0}]
["Other",4,{"$f":"A2A!C135","v":15737848},{"$f":"A2A!D135","v":0},{"$f":"A2A!E135","v":0},{"$f":"A2A!F135","v":980365.2},{"$f":"A2A!G135","v":999000},{"$f":"A2A!H135","v":0},{"$f":"A2A!I135","v":1238087.2423999999},{"$f":"A2A!J135","v":1250008.114824},{"$f":"A2A!K135","v":1277422.63597224}]
[{"$f":"\"Total \"&A27","v":"Total Expenditure - Standard"},3,{"$f":"C28+C32+C38+C42+C47","v":337918604},{"$f":"D28+D32+D38+D42+D47","v":264202200},{"$f":"E28+E32+E38+E42+E47","v":267891073},{"$f":"F28+F32+F38+F42+F47","v":186259230.49000001},191481000,0,213531008.918612,223130853.33620813,234407925.84998322]
[{"$f":"result","v":"Surplus/(Deficit) for the year"},null,{"$f":"C25-C48","v":-158841689},{"$f":"D25-D48","v":-54960990},-50080396,41955764.109999985,42133994.599999994,0,21678295.989448011,25067859.31616357,32645959.116183192]
[{"$f":"head27a","v":"References"}]
["1. Government Finance Statistics Functions and Sub-functions are standardised to assist the compilation of national and international accounts for comparison purposes"]
["2. Total Revenue by standard classification must reconcile to Total Operating Revenue shown in Budgeted Financial Performance (revenue and expenditure)"]
["3. Total Expenditure by Standard Classification must reconcile to Total Operating Expenditure shown in Budgeted Financial Performance (revenue and expenditure)"]
["4. All amounts must be classified under a standard classification (modified GFS). The GFS function 'Other' is only for Abbatoirs, Air Transport, Markets and Tourism - and if used must be supported by footnotes. Nothing else may be placed under 'Other'. Assign associate share to relevant classification"]
[]
[]
["check oprev balance",null,{"$f":"C25-'A4-FinPerf RE'!C60","v":0},{"$f":"D25-'A4-FinPerf RE'!D60","v":0},{"$f":"E25-'A4-FinPerf RE'!E60","v":0},{"$f":"F25-'A4-FinPerf RE'!F60","v":-1.4000000059604645},{"$f":"G25-'A4-FinPerf RE'!G60","v":-1.4000000059604645},{"$f":"H25-'A4-FinPerf RE'!H60","v":-228214996},{"$f":"I25-'A4-FinPerf RE'!J60","v":-2.3278594017028809E-4},{"$f":"J25-'A4-FinPerf RE'!K60","v":2.2953212261199951E-2},{"$f":"K25-'A4-FinPerf RE'!L60","v":-0.48266947269439697}]
["check opexp balance",null,{"$f":"C48-'A4-FinPerf RE'!C36","v":0},{"$f":"D48-'A4-FinPerf RE'!D36","v":0},{"$f":"E48-'A4-FinPerf RE'!E36","v":45},{"$f":"F48-'A4-FinPerf RE'!F36","v":-0.89140158891677856},{"$f":"G48-'A4-FinPerf RE'!G36","v":-1627.2814015746117},{"$f":"H48-'A4-FinPerf RE'!H36","v":-186259231.3814016},{"$f":"I48-'A4-FinPerf RE'!J36","v":0},{"$f":"J48-'A4-FinPerf RE'!K36","v":0},{"$f":"K48-'A4-FinPerf RE'!L36","v":0}]

{"sheet":"A2A","index":8,"n_rows":152,"n_cols":11,"rows_kept":152,"cut":false,"hidden":false,"merged":[[1,5,1,7],[1,8,1,10],[147,0,147,10]]}
[{"$f":"muni&\" - \"&Approve3","v":"FS205 Mafube - Table A2 Budgeted Financial Performance (revenue and expenditure by standard classification)"}]
[{"$f":"\"Standard Classification \"&desc","v":"Standard Classification Description"},{"$f":"head27","v":"Ref"},{"$f":"head1b","v":"2013/14"},{"$f":"head1A","v":"2014/15"},{"$f":"Head1","v":"2015/16"},{"$f":"Head2","v":"Current Year 2016/17"},null,null,{"$f":"Head3","v":"2017/18 Medium Term Revenue & Expenditure Framework"}]
["R thousand",1,{"$f":"Head5","v":"Audited Outcome"},{"$f":"Head5","v":"Audited Outcome"},{"$f":"Head5","v":"Audited Outcome"},{"$f":"Head6","v":"Original Budget"},{"$f":"Head7","v":"Adjusted Budget"},{"$f":"Head8","v":"Full Year Forecast"},{"$f":"Head9","v":"Budget Year 2017/18"},{"$f":"Head10","v":"Budget Year +1 2018/19"},{"$f":"Head11","v":"Budget Year +2 2019/20"}]
["Revenue - Standard"]
["Municipal governance and administration",null,{"$f":"C6+C9+C10","v":110166887},{"$f":"D6+D9+D10","v":128964469},141428114,142011255.59999999,147411255.59999999,0,146066878.28,156781478,165780513]
["Executive and council",null,{"$f":"SUM(C7:C8)","v":0},{"$f":"SUM(D7:D8)","v":0},0,0,0,0,0,0,0]
["Mayor and Council"]
["Municipal Manager"]
["Budget and treasury office",null,110166887,128964469,141428114,142011255.59999999,147411255.59999999,null,146066878.28,156781478,165780513]
["Corporate services",null,{"$f":"SUM(C11:C14)","v":0},{"$f":"SUM(D11:D14)","v":0},0,0,0,0,0,0,0]
["Human Resources"]
["Information Technology"]
["Property Services"]
["Other Admin"]
["Community and public safety",null,{"$f":"C16+C25+C26+C32+C33","v":0},{"$f":"D16+D25+D26+D32+D33","v":688651},0,0,0,0,0,0,0]
["Community and social services",null,{"$f":"SUM(C17:C24)","v":0},{"$f":"SUM(D17:D24)","v":688651},0,0,0,0,0,0,0]
["Libraries and Archives"]
["Museums & Art Galleries etc"]
["Community halls and Facilities"]
["Cemeteries & Crematoriums"]
["Child Care"]
["Aged Care"]
["Other Community",null,null,688651]
["Other Social"]
["Sport and recreation"]
["Public safety",null,{"$f":"SUM(C27:C31)","v":0},{"$f":"SUM(D27:D31)","v":0},0,0,0,0,0,0,0]
["Police"]
["Fire"]
["Civil Defence"]
["Street Lighting"]
["Other"]
["Housing"]
["Health",null,{"$f":"SUM(C34:C36)","v":0},{"$f":"SUM(D34:D36)","v":0},0,0,0,0,0,0,0]
["Clinics"]
["Ambulance"]
["Other   "]
["Economic and environmental services",null,{"$f":"C38+C42+C48","v":0},{"$f":"D38+D42+D48","v":144746},0,0,0,0,0,0,0]
["Planning and development",null,{"$f":"SUM(C39:C41)","v":0},{"$f":"SUM(D39:D41)","v":134610},0,0,0,0,0,0,0]
["Economic Development/Planning "]
["Town Planning/Building enforcement ",null,null,134610]
["Licensing & Regulation"]
["Road transport",null,{"$f":"SUM(C43:C47)","v":0},{"$f":"SUM(D43:D47)","v":10136},0,0,0,0,0,0,0]
["Roads",null,null,10136]
["Public Buses"]
["Parking Garages"]
["Vehicle Licensing and Testing"]
["Other"]
["Environmental protection",null,{"$f":"SUM(C49:C51)","v":0},{"$f":"SUM(D49:D51)","v":0},0,0,0,0,0,0,0]
["Pollution Control"]
["Biodiversity & Landscape"]
["Other"]
["Trading services",null,{"$f":"C53+C56+C59+C63","v":53962745},{"$f":"D53+D56+D59+D63","v":79443344},76382563,64781739,64781739,0,62062426.628059998,67543234.652371705,{"$f":"K53+K56+K59+K63","v":76236371.966166407}]
["Electricity",null,{"$f":"SUM(C54:C55)","v":6269791},{"$f":"SUM(D54:D55)","v":7404258},9367654,11000000,11000000,0,5000000,7000000,12000000]
["Electricity Distribution",null,6269791,7404258,9367654,11000000,11000000,null,5000000,7000000,12000000]
["Electricity Generation"]
["Water",null,{"$f":"SUM(C57:C58)","v":18518134},{"$f":"SUM(D57:D58)","v":43217236},37125741,23098759,23098759,0,24507784.338780001,26002759.183445599,27588927.4936358]
["Water Distribution",null,18518134,43217236,37125741,23098759,23098759,null,24507784.338780001,26002759.183445599,27588927.4936358]
["Water Storage"]
["Waste water management",null,{"$f":"SUM(C60:C62)","v":15312749},{"$f":"SUM(D60:D62)","v":16696403},17305717,17776153,17776153,0,18860498.714960001,20010989.136572599,21231659.4739035]
["Sewerage",null,15312749,16696403,17305717,17776153,17776153,null,18860498.714960001,20010989.136572599,21231659.4739035]
["Storm Water Management"]
["Public Toilets"]
["Waste management",null,{"$f":"SUM(C64)","v":13862071},{"$f":"SUM(D64)","v":12125447},12583451,12906827,12906827,0,13694143.57432,14529486.332353501,15415784.9986271]
["Solid Waste",null,13862071,12125447,12583451,12906827,12906827,null,13694143.57432,14529486.332353501,15415784.9986271]
["Other",null,{"$f":"SUM(C66:C71)","v":14947283},{"$f":"SUM(D66:D71)","v":0},0,21422000,21422000,0,27080000,23874000,25037000]
["Air Transport"]
["Abattoirs"]
["Tourism"]
["Forestry"]
["Markets"]
["Other",null,14947283,null,null,21422000,21422000,null,27080000,23874000,25037000]
[{"$f":"\"Total \"&A4","v":"Total Revenue - Standard"},2,{"$f":"C5+C15+C37+C52+C65","v":179076915},{"$f":"D5+D15+D37+D52+D65","v":209241210},{"$f":"E5+E15+E37+E52+E65","v":217810677},228214994.59999999,233614994.59999999,0,235209304.90806001,248198712.6523717,{"$f":"K5+K15+K37+K52+K65","v":267053884.96616641}]
[]
["Expenditure - Standard"]
[{"$f":"A5","v":"Municipal governance and administration"},null,{"$f":"C76+C79+C80","v":292257265},236363150,212236111,134780028.32000002,133316000,0,164340703.646312,168604972.01077512,172885119.48786089]
["Executive and council",null,{"$f":"SUM(C77:C78)","v":8533570},58411424,44320779,72115662.640000001,66775000,0,62755315.961411998,64128644.121026114,65351223.627236381]
["Mayor and Council",null,8533570,7339277,9852522,22163675.869999997,18134000,null,17154173.541999999,17658490.277419999,18188149.455194198]
["Municipal Manager",null,null,51072147,34468257,49951986.770000003,48641000,null,45601142.419412002,46470153.843606114,47163074.172042184]
["Budget and treasury office",null,198189107,99589241,82117563,29195828.350000001,27946000,null,70477220.988499999,72022034.526384994,73656876.818626851]
["Corporate services",null,{"$f":"SUM(C81:C84)","v":85534588},78362485,85797769,33468537.330000002,38595000,0,31108166.696399998,32454293.363364,33877019.041997641]
["Human Resources",null,85534588,73859689,79197234,7310691.1900000004,6939000,null,6401040.3542999998,6682055.7578429999,6979118.6204214282]
["Information Technology"]
["Property Services"]
["Other Admin",null,null,4502796,6600535,26157846.140000001,31656000,null,24707126.342099998,25772237.605521001,26897900.421576209]
["Community and public safety",null,{"$f":"C86+C95+C96+C102+C103","v":17326},756369,6818067,13853133.959999999,12588000,0,11232600.1482,11503281.149682,11786328.61617882]
["Community and social services",null,{"$f":"SUM(C87:C94)","v":0},734536,6818067,13853133.959999999,12588000,0,11232600.1482,11503281.149682,11786328.61617882]
["Libraries and Archives"]
["Museums & Art Galleries etc"]
["Community halls and Facilities"]
["Cemeteries & Crematoriums"]
["Child Care"]
["Aged Care"]
["Other Community",null,null,734536,6818067,13853133.959999999,12588000,null,11232600.1482,11503281.149682,11786328.61617882]
["Other Social"]
["Sport and recreation"]
["Public safety",null,{"$f":"SUM(C97:C101)","v":17326},21833,0,0,0,0,0,0,0]
["Police"]
["Fire"]
["Civil Defence"]
["Street Lighting"]
["Other",null,17326,21833]
["Housing"]
["Health",null,{"$f":"SUM(C104:C106)","v":0},0,0,0,0,0,0,0,0]
["Clinics"]
["Ambulance"]
["Other   "]
[{"$f":"A37","v":"Economic and environmental services"},null,{"$f":"C108+C112+C118","v":0},0,0,4635533.9800000004,4724000,0,4911988.8201000001,6671108.7083010003,8984366.4653840102]
["Planning and development",null,{"$f":"SUM(C109:C111)","v":0},0,0,0,0,0,0,0,0]
["Economic Development/Planning "]
["Town Planning/Building enforcement "]
["Licensing & Regulation"]
["Road transport",null,{"$f":"SUM(C113:C117)","v":0},0,0,4635533.9800000004,4724000,0,4911988.8201000001,6671108.7083010003,8984366.4653840102]
["Roads",null,null,null,null,4635533.9800000004,4724000,null,4911988.8201000001,6671108.7083010003,8984366.4653840102]
["Public Buses"]
["Parking Garages"]
["Vehicle Licensing and Testing"]
["Other"]
["Environmental protection",null,{"$f":"SUM(C119:C121)","v":0},0,0,0,0,0,0,0,0]
["Pollution Control"]
["Biodiversity & Landscape"]
["Other"]
["Trading services",null,{"$f":"C123+C126+C129+C133","v":29906165},{"$f":"D123+D126+D129+D133","v":27082681},48836895,32010169.030000001,39854000,0,31807629.0616,35101483.352625996,39474688.644587271]
["Electricity",null,{"$f":"SUM(C124:C125)","v":17199992},6729008,10962325,7494938.2400000002,7724000,0,7685341.0805000002,9885494.4913050011,11937082.73621805]
["Electricity Distribution",null,17199992,6729008,10962325,7494938.2400000002,7724000,null,7685341.0805000002,9885494.4913050011,11937082.73621805]
["Electricity Generation"]
["Water",null,{"$f":"SUM(C127:C128)","v":12706173},20353673,37874570,24515230.789999999,32130000,0,24122287.9811,25215988.861320999,27537605.908369221]
["Water Distribution",null,12706173,20353673,37874570,24515230.789999999,32130000,null,24122287.9811,25215988.861320999,27537605.908369221]
["Water Storage"]
["Waste water management",null,{"$f":"SUM(C130:C132)","v":0},0,0,0,0,0,0,0,0]
["Sewerage"]
["Storm Water Management"]
["Public Toilets"]
["Waste management",null,{"$f":"SUM(C134)","v":0},0,0,0,0,0,0,0,0]
["Solid Waste"]
["Other",null,{"$f":"SUM(C136:C141)","v":15737848},{"$f":"SUM(D136:D141)","v":0},0,980365.2,999000,0,1238087.2423999999,1250008.114824,1277422.63597224]
["Air Transport"]
["Abattoirs"]
["Tourism"]
[{"$f":"A69","v":"Forestry"}]
[{"$f":"A70","v":"Markets"}]
["Other",null,15737848,null,null,980365.2,999000,null,1238087.2423999999,1250008.114824,1277422.63597224]
[{"$f":"\"Total \"&A74","v":"Total Expenditure - Standard"},3,{"$f":"C75+C85+C107+C122+C135","v":337918604},{"$f":"D75+D85+D107+D122+D135","v":264202200},{"$f":"E75+E85+E107+E122+E135","v":267891073},186259230.49000001,191481000,0,213531008.918612,223130853.33620813,{"$f":"K75+K85+K107+K122+K135","v":234407925.84998322}]
[{"$f":"result","v":"Surplus/(Deficit) for the year"},null,{"$f":"C72-C142","v":-158841689},-54960990,-50080396,41955764.109999985,42133994.599999994,0,21678295.989448011,25067859.31616357,32645959.116183192]
[{"$f":"head27a","v":"References"}]
["1. Government Finance Statistics Functions and Sub-functions are standardised to assist national and international accounts and comparison"]
["2. Total Revenue by Standard Classification must reconcile to total operating revenue shown in Financial Performance (revenue and expenditure)"]
["3. Total Expenditure by Standard Classification must reconcile to total operating expenditure shown in Financial Performance (revenue and expenditure)"]
["4. All amounts must be classified under a Standard (modified GFS) classification. The GFS function 'Other' is only for Abbatoirs, Air Transport, Markets and Tourism - and if used must be supported by footnotes. Nothing else may be placed under 'Other'. Assign associate share to relevant classification"]
[]
[]
["check oprev balance",null,{"$f":"C72-'A4-FinPerf RE'!C60","v":0},{"$f":"D72-'A4-FinPerf RE'!D60","v":0},{"$f":"E72-'A4-FinPerf RE'!E60","v":0},{"$f":"F72-'A4-FinPerf RE'!F60","v":-1.4000000059604645},{"$f":"G72-'A4-FinPerf RE'!G60","v":-1.4000000059604645},{"$f":"H72-'A4-FinPerf RE'!H60","v":-228214996},{"$f":"I72-'A4-FinPerf RE'!J60","v":-2.3278594017028809E-4},{"$f":"J72-'A4-FinPerf RE'!K60","v":2.2953212261199951E-2},{"$f":"K72-'A4-FinPerf RE'!L60","v":-0.48266947269439697}]
["check opexp balance",null,{"$f":"C142-'A4-FinPerf RE'!C36","v":0},{"$f":"D142-'A4-FinPerf RE'!D36","v":0},{"$f":"E142-'A4-FinPerf RE'!E36","v":45},{"$f":"F142-'A4-FinPerf RE'!F36","v":-0.89140158891677856},{"$f":"G142-'A4-FinPerf RE'!G36","v":-1627.2814015746117},{"$f":"H142-'A4-FinPerf RE'!H36","v":-186259231.3814016},{"$f":"I142-'A4-FinPerf RE'!J36","v":0},{"$f":"J142-'A4-FinPerf RE'!K36","v":0},{"$f":"K142-'A4-FinPerf RE'!L36","v":0}]

{"sheet":"A3-FinPerf V","index":9,"n_rows":45,"n_cols":23,"rows_kept":45,"cut":false,"hidden":false,"merged":[[1,5,1,7],[1,8,1,10],[1,11,1,22]]}
[{"$f":"muni&\" - \"&Approve2","v":"FS205 Mafube - Table A3 Budgeted Financial Performance (revenue and expenditure by municipal vote)"}]
[{"$f":"Vdesc","v":"Vote Description"},{"$f":"head27","v":"Ref"},{"$f":"head1b","v":"2013/14"},{"$f":"head1A","v":"2014/15"},{"$f":"Head1","v":"2015/16"},{"$f":"Head2","v":"Current Year 2016/17"},null,null,{"$f":"Head3","v":"2017/18 Medium Term Revenue & Expenditure Framework"},null,null,{"$f":"Head4","v":"LTFS"}]
["R thousand",null,{"$f":"Head5","v":"Audited Outcome"},{"$f":"Head5","v":"Audited Outcome"},{"$f":"Head5","v":"Audited Outcome"},{"$f":"Head6","v":"Original Budget"},{"$f":"Head7","v":"Adjusted Budget"},{"$f":"Head8","v":"Full Year Forecast"},{"$f":"Head9","v":"Budget Year 2017/18"},{"$f":"Head10","v":"Budget Year +1 2018/19"},{"$f":"Head11","v":"Budget Year +2 2019/20"},{"$f":"Head12","v":"Forecast 2020/21"},{"$f":"Head13","v":"Forecast 2021/22"},{"$f":"Head14","v":"Forecast 2022/23"},{"$f":"Head15","v":"Forecast 2023/24"},{"$f":"Head16","v":"Forecast 2024/25"},{"$f":"Head17","v":"Forecast 2025/26"},{"$f":"Head18","v":"Forecast 2026/27"},{"$f":"Head19","v":"Forecast 2027/28"},{"$f":"Head20","v":"Forecast 2028/29"},{"$f":"Head21","v":"Forecast 2029/30"},{"$f":"Head22","v":"Forecast 2030/31"},{"$f":"Head23","v":"Forecast 2031/32"}]
["Revenue by Vote",1]
[{"$f":"A3A!A5","v":"Vote 1 - OFFICE OF THE MAYOR"},null,{"$f":"A3A!C5","v":0},{"$f":"A3A!D5","v":0},{"$f":"A3A!E5","v":0},{"$f":"A3A!F5","v":0},{"$f":"A3A!G5","v":0},{"$f":"A3A!H5","v":0},{"$f":"A3A!I5","v":0},{"$f":"A3A!J5","v":0},{"$f":"A3A!K5","v":0}]
[{"$f":"A3A!A16","v":"Vote 2 - OFFICE OF THE SPEAKER"},null,{"$f":"A3A!C16","v":0},{"$f":"A3A!D16","v":0},{"$f":"A3A!E16","v":0},{"$f":"A3A!F16","v":0},{"$f":"A3A!G16","v":0},{"$f":"A3A!H16","v":0},{"$f":"A3A!I16","v":0},{"$f":"A3A!J16","v":0},{"$f":"A3A!K16","v":0}]
[{"$f":"A3A!A27","v":"Vote 3 - OFFICE OF THE MUNICIPAL MANAGER"},null,{"$f":"A3A!C27","v":0},{"$f":"A3A!D27","v":134610},{"$f":"A3A!E27","v":0},{"$f":"A3A!F27","v":0},{"$f":"A3A!G27","v":0},{"$f":"A3A!H27","v":0},{"$f":"A3A!I27","v":0},{"$f":"A3A!J27","v":0},{"$f":"A3A!K27","v":0}]
[{"$f":"A3A!A38","v":"Vote 4 - COMMUNITY SERVICES"},null,{"$f":"A3A!C38","v":13862071},{"$f":"A3A!D38","v":12814098},{"$f":"A3A!E38","v":12583451},{"$f":"A3A!F38","v":12906827.119999999},{"$f":"A3A!G38","v":12906827.119999999},{"$f":"A3A!H38","v":0},{"$f":"A3A!I38","v":13694144},{"$f":"A3A!J38","v":14529486},{"$f":"A3A!K38","v":15415785}]
[{"$f":"A3A!A49","v":"Vote 5 - CORPORATE SERVICES"},null,{"$f":"A3A!C49","v":0},{"$f":"A3A!D49","v":0},{"$f":"A3A!E49","v":0},{"$f":"A3A!F49","v":0},{"$f":"A3A!G49","v":0},{"$f":"A3A!H49","v":0},{"$f":"A3A!I49","v":0},{"$f":"A3A!J49","v":0},{"$f":"A3A!K49","v":0}]
[{"$f":"A3A!A60","v":"Vote 6 - FINANCIAL SERVICES"},null,{"$f":"A3A!C60","v":110166887},{"$f":"A3A!D60","v":128964469},{"$f":"A3A!E60","v":141428114},{"$f":"A3A!F60","v":142011255.59999999},{"$f":"A3A!G60","v":147411255.59999999},{"$f":"A3A!H60","v":0},{"$f":"A3A!I60","v":146066877.90829301},{"$f":"A3A!J60","v":156781478.62941799},{"$f":"A3A!K60","v":165780514.448836}]
[{"$f":"A3A!A71","v":"Vote 7 - INFRASTRUCTURE SERVICES"},null,{"$f":"A3A!C71","v":55047957},{"$f":"A3A!D71","v":67328033},{"$f":"A3A!E71","v":63799112},{"$f":"A3A!F71","v":73296913.340000004},{"$f":"A3A!G71","v":73296913.340000004},{"$f":"A3A!H71","v":0},{"$f":"A3A!I71","v":75448283},{"$f":"A3A!J71","v":76887748},{"$f":"A3A!K71","v":85857586}]
[{"$f":"A3A!A82","v":"Vote 8 - SERVICE DELIVERY AND PUBLIC SAFETY"},null,{"$f":"A3A!C82","v":0},{"$f":"A3A!D82","v":0},{"$f":"A3A!E82","v":0},{"$f":"A3A!F82","v":0},{"$f":"A3A!G82","v":0},{"$f":"A3A!H82","v":0},{"$f":"A3A!I82","v":0},{"$f":"A3A!J82","v":0},{"$f":"A3A!K82","v":0}]
[{"$f":"A3A!A93","v":"Vote 9 - [NAME OF VOTE 9]"},null,{"$f":"A3A!C93","v":0},{"$f":"A3A!D93","v":0},{"$f":"A3A!E93","v":0},{"$f":"A3A!F93","v":0},{"$f":"A3A!G93","v":0},{"$f":"A3A!H93","v":0},{"$f":"A3A!I93","v":0},{"$f":"A3A!J93","v":0},{"$f":"A3A!K93","v":0}]
[{"$f":"A3A!A104","v":"Vote 10 - [NAME OF VOTE 10]"},null,{"$f":"A3A!C104","v":0},{"$f":"A3A!D104","v":0},{"$f":"A3A!E104","v":0},{"$f":"A3A!F104","v":0},{"$f":"A3A!G104","v":0},{"$f":"A3A!H104","v":0},{"$f":"A3A!I104","v":0},{"$f":"A3A!J104","v":0},{"$f":"A3A!K104","v":0}]
[{"$f":"A3A!A115","v":"Vote 11 - [NAME OF VOTE 11]"},null,{"$f":"A3A!C115","v":0},{"$f":"A3A!D115","v":0},{"$f":"A3A!E115","v":0},{"$f":"A3A!F115","v":0},{"$f":"A3A!G115","v":0},{"$f":"A3A!H115","v":0},{"$f":"A3A!I115","v":0},{"$f":"A3A!J115","v":0},{"$f":"A3A!K115","v":0},{"$f":"A5A!L115","v":0}]
[{"$f":"A3A!A126","v":"Vote 12 - [NAME OF VOTE 12]"},null,{"$f":"A3A!C126","v":0},{"$f":"A3A!D126","v":0},{"$f":"A3A!E126","v":0},{"$f":"A3A!F126","v":0},{"$f":"A3A!G126","v":0},{"$f":"A3A!H126","v":0},{"$f":"A3A!I126","v":0},{"$f":"A3A!J126","v":0},{"$f":"A3A!K126","v":0},{"$f":"A5A!L126","v":0}]
[{"$f":"A3A!A137","v":"Vote 13 - [NAME OF VOTE 13]"},null,{"$f":"A3A!C137","v":0},{"$f":"A3A!D137","v":0},{"$f":"A3A!E137","v":0},{"$f":"A3A!F137","v":0},{"$f":"A3A!G137","v":0},{"$f":"A3A!H137","v":0},{"$f":"A3A!I137","v":0},{"$f":"A3A!J137","v":0},{"$f":"A3A!K137","v":0},{"$f":"A5A!L137","v":0}]
[{"$f":"A3A!A148","v":"Vote 14 - [NAME OF VOTE 14]"},null,{"$f":"A3A!C148","v":0},{"$f":"A3A!D148","v":0},{"$f":"A3A!E148","v":0},{"$f":"A3A!F148","v":0},{"$f":"A3A!G148","v":0},{"$f":"A3A!H148","v":0},{"$f":"A3A!I148","v":0},{"$f":"A3A!J148","v":0},{"$f":"A3A!K148","v":0},{"$f":"A5A!L148","v":0}]
[{"$f":"A3A!A159","v":"Vote 15 - [NAME OF VOTE 15]"},null,{"$f":"A3A!C159","v":0},{"$f":"A3A!D159","v":0},{"$f":"A3A!E159","v":0},{"$f":"A3A!F159","v":0},{"$f":"A3A!G159","v":0},{"$f":"A3A!H159","v":0},{"$f":"A3A!I159","v":0},{"$f":"A3A!J159","v":0},{"$f":"A3A!K159","v":0},{"$f":"A5A!L159","v":0}]
["Total Revenue by Vote",2,{"$f":"SUM(C5:C19)","v":179076915},{"$f":"SUM(D5:D19)","v":209241210},217810677,228214996.06,233614996.06,0,235209304.90829301,248198712.62941799,267053885.448836]
[]
["Expenditure by Vote to be appropriated",1]
[{"$f":"A3A!A173","v":"Vote 1 - OFFICE OF THE MAYOR"},null,{"$f":"A3A!C173","v":8850580},{"$f":"A3A!D173","v":7339277},{"$f":"A3A!E173","v":9852522},{"$f":"A3A!F173","v":10955747.869999999},{"$f":"A3A!G173","v":7665110.2199999988},{"$f":"A3A!H173","v":0},{"$f":"A3A!I173","v":7134761.7160999998},{"$f":"A3A!J173","v":7468759.333261},{"$f":"A3A!K173","v":7822118.5765936095}]
[{"$f":"A3A!A184","v":"Vote 2 - OFFICE OF THE SPEAKER"},null,{"$f":"A3A!C184","v":0},{"$f":"A3A!D184","v":0},{"$f":"A3A!E184","v":0},{"$f":"A3A!F184","v":11207928.35},{"$f":"A3A!G184","v":10468823.59},{"$f":"A3A!H184","v":0},{"$f":"A3A!I184","v":10019411.8259},{"$f":"A3A!J184","v":10189730.944159001},{"$f":"A3A!K184","v":10366030.87860059}]
[{"$f":"A3A!A195","v":"Vote 3 - OFFICE OF THE MUNICIPAL MANAGER"},null,{"$f":"A3A!C195","v":2836462},{"$f":"A3A!D195","v":51072147},{"$f":"A3A!E195","v":34468257},{"$f":"A3A!F195","v":49951986.770000003},{"$f":"A3A!G195","v":48391417.079999998},{"$f":"A3A!H195","v":0},{"$f":"A3A!I195","v":45601142.419412002},{"$f":"A3A!J195","v":46470153.843606114},{"$f":"A3A!K195","v":47163074.172042169}]
[{"$f":"A3A!A206","v":"Vote 4 - COMMUNITY SERVICES"},null,{"$f":"A3A!C206","v":13862071},{"$f":"A3A!D206","v":734536},{"$f":"A3A!E206","v":6818067},{"$f":"A3A!F206","v":13853133.959999999},{"$f":"A3A!G206","v":12587923.659999998},{"$f":"A3A!H206","v":0},{"$f":"A3A!I206","v":11232600.1482},{"$f":"A3A!J206","v":11503281.149682},{"$f":"A3A!K206","v":11786328.616178822}]
[{"$f":"A3A!A217","v":"Vote 5 - CORPORATE SERVICES"},null,{"$f":"A3A!C217","v":77187777},{"$f":"A3A!D217","v":78362485},{"$f":"A3A!E217","v":85797769},{"$f":"A3A!F217","v":33468537.32},{"$f":"A3A!G217","v":38595767.770000003},{"$f":"A3A!H217","v":0},{"$f":"A3A!I217","v":31108166.696399998},{"$f":"A3A!J217","v":32454293.363364},{"$f":"A3A!K217","v":33877019.041997641}]
[{"$f":"A3A!A228","v":"Vote 6 - FINANCIAL SERVICES"},null,{"$f":"A3A!C228","v":181113830},{"$f":"A3A!D228","v":99589241},{"$f":"A3A!E228","v":82117563},{"$f":"A3A!F228","v":29195828.359999999},{"$f":"A3A!G228","v":27445885.049999997},{"$f":"A3A!H228","v":0},{"$f":"A3A!I228","v":70477220.988499999},{"$f":"A3A!J228","v":72022034.526384994},{"$f":"A3A!K228","v":73656876.818626851}]
[{"$f":"A3A!A239","v":"Vote 7 - INFRASTRUCTURE SERVICES"},null,{"$f":"A3A!C239","v":45644013},{"$f":"A3A!D239","v":27082681},{"$f":"A3A!E239","v":48836895},{"$f":"A3A!F239","v":37626068.210000001},{"$f":"A3A!G239","v":46326763.600000009},{"$f":"A3A!H239","v":0},{"$f":"A3A!I239","v":37957705.1241},{"$f":"A3A!J239","v":43022600.175751001},{"$f":"A3A!K239","v":49736477.745943524}]
[{"$f":"A3A!A250","v":"Vote 8 - SERVICE DELIVERY AND PUBLIC SAFETY"},null,{"$f":"A3A!C250","v":17326},{"$f":"A3A!D250","v":21833},{"$f":"A3A!E250","v":0},{"$f":"A3A!F250","v":0},{"$f":"A3A!G250","v":0},{"$f":"A3A!H250","v":0},{"$f":"A3A!I250","v":0},{"$f":"A3A!J250","v":0},{"$f":"A3A!K250","v":0}]
[{"$f":"A3A!A261","v":"Vote 9 - [NAME OF VOTE 9]"},null,{"$f":"A3A!C261","v":0},{"$f":"A3A!D261","v":0},{"$f":"A3A!E261","v":0},{"$f":"A3A!F261","v":0},{"$f":"A3A!G261","v":0},{"$f":"A3A!H261","v":0},{"$f":"A3A!I261","v":0},{"$f":"A3A!J261","v":0},{"$f":"A3A!K261","v":0}]
[{"$f":"A3A!A272","v":"Vote 10 - [NAME OF VOTE 10]"},null,{"$f":"A3A!C272","v":0},{"$f":"A3A!D272","v":0},{"$f":"A3A!E272","v":0},{"$f":"A3A!F272","v":0},{"$f":"A3A!G272","v":0},{"$f":"A3A!H272","v":0},{"$f":"A3A!I272","v":0},{"$f":"A3A!J272","v":0},{"$f":"A3A!K272","v":0}]
[{"$f":"A3A!A283","v":"Vote 11 - [NAME OF VOTE 11]"},null,{"$f":"A3A!C283","v":0},{"$f":"A3A!D283","v":0},{"$f":"A3A!E283","v":0},{"$f":"A3A!F283","v":0},{"$f":"A3A!G283","v":0},{"$f":"A3A!H283","v":0},{"$f":"A3A!I283","v":0},{"$f":"A3A!J283","v":0},{"$f":"A3A!K283","v":0},{"$f":"A3A!L284","v":0}]
[{"$f":"A3A!A294","v":"Vote 12 - [NAME OF VOTE 12]"},null,{"$f":"A3A!C294","v":0},{"$f":"A3A!D294","v":0},{"$f":"A3A!E294","v":0},{"$f":"A3A!F294","v":0},{"$f":"A3A!G294","v":0},{"$f":"A3A!H294","v":0},{"$f":"A3A!I294","v":0},{"$f":"A3A!J294","v":0},{"$f":"A3A!K294","v":0},{"$f":"A3A!L295","v":0}]
[{"$f":"A3A!A305","v":"Vote 13 - [NAME OF VOTE 13]"},null,{"$f":"A3A!C305","v":0},{"$f":"A3A!D305","v":0},{"$f":"A3A!E305","v":0},{"$f":"A3A!F305","v":0},{"$f":"A3A!G305","v":0},{"$f":"A3A!H305","v":0},{"$f":"A3A!I305","v":0},{"$f":"A3A!J305","v":0},{"$f":"A3A!K305","v":0},{"$f":"A3A!L306","v":0}]
[{"$f":"A3A!A316","v":"Vote 14 - [NAME OF VOTE 14]"},null,{"$f":"A3A!C316","v":0},{"$f":"A3A!D316","v":0},{"$f":"A3A!E316","v":0},{"$f":"A3A!F316","v":0},{"$f":"A3A!G316","v":0},{"$f":"A3A!H316","v":0},{"$f":"A3A!I316","v":0},{"$f":"A3A!J316","v":0},{"$f":"A3A!K316","v":0},{"$f":"A3A!L317","v":0}]
[{"$f":"A3A!A327","v":"Vote 15 - [NAME OF VOTE 15]"},null,{"$f":"A3A!C327","v":0},{"$f":"A3A!D327","v":0},{"$f":"A3A!E327","v":0},{"$f":"A3A!F327","v":0},{"$f":"A3A!G327","v":0},{"$f":"A3A!H327","v":0},{"$f":"A3A!I327","v":0},{"$f":"A3A!J327","v":0},{"$f":"A3A!K327","v":0},{"$f":"A3A!L328","v":0}]
["Total Expenditure by Vote",2,{"$f":"SUM(C23:C37)","v":329512059},{"$f":"SUM(D23:D37)","v":264202200},267891073,186259230.84,191481690.97000003,0,213531008.918612,223130853.33620811,234407925.84998319,{"$f":"SUM(L23:L29)","v":0},0,0,0,0,0,0,0,0,0,0,0]
[{"$f":"result","v":"Surplus/(Deficit) for the year"},2,{"$f":"C20-C38","v":-150435144},-54960990,-50080396,41955765.219999999,42133305.089999974,0,21678295.989681005,25067859.293209881,32645959.598852813,0,0,0,0,0,0,0,0,0,0,0,0]
[{"$f":"head27a","v":"References"}]
["1. Insert 'Vote'; e.g. department, if different to standard classification structure"]
["2. Must reconcile to Budgeted Financial Performance (revenue and expenditure)"]
["3. Assign share in 'associate' to relevant Vote"]
[]
[{"$f":"\"check \"&A39","v":"check Surplus/(Deficit) for the year"},null,{"$f":"C39-A3A!C340","v":0},{"$f":"D39-A3A!D340","v":0},{"$f":"E39-A3A!E340","v":0},{"$f":"F39-A3A!F340","v":0},{"$f":"G39-A3A!G340","v":0},{"$f":"H39-A3A!H340","v":0},{"$f":"I39-A3A!I340","v":0},{"$f":"J39-A3A!J340","v":0},{"$f":"K39-A3A!K340","v":0}]

{"sheet":"A3A","index":10,"n_rows":347,"n_cols":23,"rows_kept":347,"cut":false,"hidden":false,"merged":[[1,11,1,22],[1,5,1,7],[1,8,1,10]]}
[{"$f":"muni&\" - \"&Approve2&\"A\"","v":"FS205 Mafube - Table A3 Budgeted Financial Performance (revenue and expenditure by municipal vote)A"}]
[{"$f":"Vdesc","v":"Vote Description"},{"$f":"head27","v":"Ref"},{"$f":"head1b","v":"2013/14"},{"$f":"head1A","v":"2014/15"},{"$f":"Head1","v":"2015/16"},{"$f":"Head2","v":"Current Year 2016/17"},null,null,{"$f":"Head3","v":"2017/18 Medium Term Revenue & Expenditure Framework"},null,null,{"$f":"Head4","v":"LTFS"}]
["R thousand",null,{"$f":"Head5","v":"Audited Outcome"},{"$f":"Head5","v":"Audited Outcome"},{"$f":"Head5","v":"Audited Outcome"},{"$f":"Head6","v":"Original Budget"},{"$f":"Head7","v":"Adjusted Budget"},{"$f":"Head8","v":"Full Year Forecast"},{"$f":"Head9","v":"Budget Year 2017/18"},{"$f":"Head10","v":"Budget Year +1 2018/19"},{"$f":"Head11","v":"Budget Year +2 2019/20"},{"$f":"Head12","v":"Forecast 2020/21"},{"$f":"Head13","v":"Forecast 2021/22"},{"$f":"Head14","v":"Forecast 2022/23"},{"$f":"Head15","v":"Forecast 2023/24"},{"$f":"Head16","v":"Forecast 2024/25"},{"$f":"Head17","v":"Forecast 2025/26"},{"$f":"Head18","v":"Forecast 2026/27"},{"$f":"Head19","v":"Forecast 2027/28"},{"$f":"Head20","v":"Forecast 2028/29"},{"$f":"Head21","v":"Forecast 2029/30"},{"$f":"Head22","v":"Forecast 2030/31"},{"$f":"Head23","v":"Forecast 2031/32"}]
["Revenue by Vote",1]
[{"$f":"'Org structure'!A2","v":"Vote 1 - OFFICE OF THE MAYOR"},null,{"$f":"SUM(C6:C15)","v":0},{"$f":"SUM(D6:D15)","v":0},0,0,0,0,0,0,0]
[{"$f":"'Org structure'!E3","v":"1,1 - Office of the mayor"}]
[{"$f":"'Org structure'!E4","v":0}]
[{"$f":"'Org structure'!E5","v":0}]
[{"$f":"'Org structure'!E6","v":0}]
[{"$f":"'Org structure'!E7","v":0}]
[{"$f":"'Org structure'!E8","v":0}]
[{"$f":"'Org structure'!E9","v":0}]
[{"$f":"'Org structure'!E10","v":0}]
[{"$f":"'Org structure'!E11","v":0}]
[{"$f":"'Org structure'!E12","v":0}]
[{"$f":"'Org structure'!A3","v":"Vote 2 - OFFICE OF THE SPEAKER"},null,{"$f":"SUM(C17:C26)","v":0},{"$f":"SUM(D17:D26)","v":0},0,0,0,0,0,0,0]
[{"$f":"'Org structure'!E14","v":"2,1 - Office of the speaker"}]
[{"$f":"'Org structure'!E15","v":0}]
[{"$f":"'Org structure'!E16","v":0}]
[{"$f":"'Org structure'!E17","v":0}]
[{"$f":"'Org structure'!E18","v":0}]
[{"$f":"'Org structure'!E19","v":0}]
[{"$f":"'Org structure'!E20","v":0}]
[{"$f":"'Org structure'!E21","v":0}]
[{"$f":"'Org structure'!E22","v":0}]
[{"$f":"'Org structure'!E23","v":0}]
[{"$f":"'Org structure'!A4","v":"Vote 3 - OFFICE OF THE MUNICIPAL MANAGER"},null,{"$f":"SUM(C28:C37)","v":0},134610,0,0,0,0,0,0,0]
[{"$f":"'Org structure'!E25","v":"3,1 - Municipal Manager Administration"}]
[{"$f":"'Org structure'!E26","v":"3,2 - Internal Audit"}]
[{"$f":"'Org structure'!E27","v":"3,3 - PMS/IDP"}]
[{"$f":"'Org structure'!E28","v":"3,4 - Information Technology"}]
[{"$f":"'Org structure'!E29","v":"3,5 - Villiers"}]
[{"$f":"'Org structure'!E30","v":"3,6 - Tweeling"}]
[{"$f":"'Org structure'!E31","v":"3,7 - Cornelia"}]
[{"$f":"'Org structure'!E32","v":"3,8 - Local Economic Development"}]
[{"$f":"'Org structure'!E33","v":"3,9 - Town Planning"},null,null,134610]
[{"$f":"'Org structure'!E34","v":0}]
[{"$f":"'Org structure'!A5","v":"Vote 4 - COMMUNITY SERVICES"},null,{"$f":"SUM(C39:C48)","v":13862071},12814098,12583451,12906827.119999999,12906827.119999999,0,13694144,14529486,15415785]
[{"$f":"'Org structure'!E36","v":"4,1 - Enviromental Management"},null,13862071,12814098,12583451,12906827.119999999,12906827.119999999,null,13694144,{"$f":"14529486","v":14529486},{"$f":"15415785","v":15415785}]
[{"$f":"'Org structure'!E37","v":"4,2 - Social Development"}]
[{"$f":"'Org structure'!E38","v":"4,3 - Local Economic Development"}]
[{"$f":"'Org structure'!E39","v":0}]
[{"$f":"'Org structure'!E40","v":0}]
[{"$f":"'Org structure'!E41","v":0}]
[{"$f":"'Org structure'!E42","v":0}]
[{"$f":"'Org structure'!E43","v":0}]
[{"$f":"'Org structure'!E44","v":0}]
[{"$f":"'Org structure'!E45","v":0}]
[{"$f":"'Org structure'!A6","v":"Vote 5 - CORPORATE SERVICES"},null,{"$f":"SUM(C50:C59)","v":0},{"$f":"SUM(D50:D59)","v":0},0,0,0,0,0,0,0]
[{"$f":"'Org structure'!E47","v":"5,1 - Administration and Legal"}]
[{"$f":"'Org structure'!E48","v":"5,2 - Human Resources"}]
[{"$f":"'Org structure'!E49","v":"5,3 - Property and Ground Management"}]
[{"$f":"'Org structure'!E50","v":"5,4 - Security Services"}]
[{"$f":"'Org structure'!E51","v":0}]
[{"$f":"'Org structure'!E52","v":0}]
[{"$f":"'Org structure'!E53","v":0}]
[{"$f":"'Org structure'!E54","v":0}]
[{"$f":"'Org structure'!E55","v":0}]
[{"$f":"'Org structure'!E56","v":0}]
[{"$f":"'Org structure'!A7","v":"Vote 6 - FINANCIAL SERVICES"},null,{"$f":"SUM(C61:C70)","v":110166887},{"$f":"SUM(D61:D70)","v":128964469},141428114,142011255.59999999,147411255.59999999,0,146066877.90829301,156781478.62941799,165780514.448836]
[{"$f":"'Org structure'!E58","v":"6,1 - Revenue and Budget Management"},null,110166887,128964469,141428114,142011255.59999999,147411255.59999999,null,146066877.90829301,156781478.62941799,165780514.448836]
[{"$f":"'Org structure'!E59","v":"6,2 - Budget Management"}]
[{"$f":"'Org structure'!E60","v":"6,3 - Expenditure Management"}]
[{"$f":"'Org structure'!E61","v":"6,4 - Supply Chain Management"}]
[{"$f":"'Org structure'!E62","v":"6,5 - Financial Accounting"}]
[{"$f":"'Org structure'!E63","v":"6,6 - Revenue & Budget"}]
[{"$f":"'Org structure'!E64","v":"6,7 - SCM & Expenditure"}]
[{"$f":"'Org structure'!E65","v":0}]
[{"$f":"'Org structure'!E66","v":0}]
[{"$f":"'Org structure'!E67","v":0}]
[{"$f":"'Org structure'!A8","v":"Vote 7 - INFRASTRUCTURE SERVICES"},null,{"$f":"SUM(C72:C81)","v":55047957},67328033,63799112,73296913.340000004,73296913.340000004,0,75448283,76887748,85857586]
[{"$f":"'Org structure'!E69","v":"7,1 - Town Planning"}]
[{"$f":"'Org structure'!E70","v":"7,2 - Project Management Unit "}]
[{"$f":"'Org structure'!E71","v":"7,3 - Roads and Stormwater"},null,null,10136]
[{"$f":"'Org structure'!E72","v":"7,4 - Electricity and Mechanical"},null,6269791,7404258,9367654,11000000,11000000,null,5000000,7000000,12000000]
[{"$f":"'Org structure'!E73","v":"7,5 - Water and Sanitation"},null,33830883,59913639,54431458,17776153.359999999,17776153.359999999,null,43368283,46013748,48820586]
[{"$f":"'Org structure'!E74","v":"7,6 - Water testing"},null,null,null,null,23098759.98,23098759.98]
[{"$f":"'Org structure'!E75","v":"7,7 - Pump and Electrical Maintenance"}]
[{"$f":"'Org structure'!E76","v":0},null,14947283,null,null,21422000,21422000,null,27080000,23874000,25037000]
[{"$f":"'Org structure'!E77","v":0}]
[{"$f":"'Org structure'!E78","v":0}]
[{"$f":"'Org structure'!A9","v":"Vote 8 - SERVICE DELIVERY AND PUBLIC SAFETY"},null,{"$f":"SUM(C83:C92)","v":0},{"$f":"SUM(D83:D92)","v":0},0,0,0,0,0,0,0]
[{"$f":"'Org structure'!E80","v":"8,1 - Villiers"}]
[{"$f":"'Org structure'!E81","v":"8,2 - Tweeling"}]
[{"$f":"'Org structure'!E82","v":"8,3 - Cornelia"}]
[{"$f":"'Org structure'!E83","v":"8,4 - Public Safety"}]
[{"$f":"'Org structure'!E84","v":0}]
[{"$f":"'Org structure'!E85","v":0}]
[{"$f":"'Org structure'!E86","v":0}]
[{"$f":"'Org structure'!E87","v":0}]
[{"$f":"'Org structure'!E88","v":0}]
[{"$f":"'Org structure'!E89","v":0}]
[{"$f":"'Org structure'!A10","v":"Vote 9 - [NAME OF VOTE 9]"},null,{"$f":"SUM(C94:C103)","v":0},{"$f":"SUM(D94:D103)","v":0},0,0,0,0,0,0,0]
[{"$f":"'Org structure'!E91","v":"9.1 - [Name of sub-vote]"}]
[{"$f":"'Org structure'!E92","v":0}]
[{"$f":"'Org structure'!E93","v":0}]
[{"$f":"'Org structure'!E94","v":0}]
[{"$f":"'Org structure'!E95","v":0}]
[{"$f":"'Org structure'!E96","v":0}]
[{"$f":"'Org structure'!E97","v":0}]
[{"$f":"'Org structure'!E98","v":0}]
[{"$f":"'Org structure'!E99","v":0}]
[{"$f":"'Org structure'!E100","v":0}]
[{"$f":"'Org structure'!A11","v":"Vote 10 - [NAME OF VOTE 10]"},null,{"$f":"SUM(C105:C114)","v":0},{"$f":"SUM(D105:D114)","v":0},0,0,0,0,0,0,0]
[{"$f":"'Org structure'!E102","v":"10.1 - [Name of sub-vote]"}]
[{"$f":"'Org structure'!E103","v":0}]
[{"$f":"'Org structure'!E104","v":0}]
[{"$f":"'Org structure'!E105","v":0}]
[{"$f":"'Org structure'!E106","v":0}]
[{"$f":"'Org structure'!E107","v":0}]
[{"$f":"'Org structure'!E108","v":0}]
[{"$f":"'Org structure'!E109","v":0}]
[{"$f":"'Org structure'!E110","v":0}]
[{"$f":"'Org structure'!E111","v":0}]
[{"$f":"'Org structure'!A12","v":"Vote 11 - [NAME OF VOTE 11]"},null,{"$f":"SUM(C116:C125)","v":0},{"$f":"SUM(D116:D125)","v":0},0,0,0,0,0,0,0]
[{"$f":"'Org structure'!E113","v":"11.1 - [Name of sub-vote]"}]
[{"$f":"'Org structure'!E114","v":0}]
[{"$f":"'Org structure'!E115","v":0}]
[{"$f":"'Org structure'!E116","v":0}]
[{"$f":"'Org structure'!E117","v":0}]
[{"$f":"'Org structure'!E118","v":0}]
[{"$f":"'Org structure'!E119","v":0}]
[{"$f":"'Org structure'!E120","v":0}]
[{"$f":"'Org structure'!E121","v":0}]
[{"$f":"'Org structure'!E122","v":0}]
[{"$f":"'Org structure'!A13","v":"Vote 12 - [NAME OF VOTE 12]"},null,{"$f":"SUM(C127:C136)","v":0},{"$f":"SUM(D127:D136)","v":0},0,0,0,0,0,0,0]
[{"$f":"'Org structure'!E124","v":"12.1 - [Name of sub-vote]"}]
[{"$f":"'Org structure'!E125","v":0}]
[{"$f":"'Org structure'!E126","v":0}]
[{"$f":"'Org structure'!E127","v":0}]
[{"$f":"'Org structure'!E128","v":0}]
[{"$f":"'Org structure'!E129","v":0}]
[{"$f":"'Org structure'!E130","v":0}]
[{"$f":"'Org structure'!E131","v":0}]
[{"$f":"'Org structure'!E132","v":0}]
[{"$f":"'Org structure'!E133","v":0}]
[{"$f":"'Org structure'!A14","v":"Vote 13 - [NAME OF VOTE 13]"},null,{"$f":"SUM(C138:C147)","v":0},{"$f":"SUM(D138:D147)","v":0},0,0,0,0,0,0,0]
[{"$f":"'Org structure'!E135","v":"13.1 - [Name of sub-vote]"}]
[{"$f":"'Org structure'!E136","v":0}]
[{"$f":"'Org structure'!E137","v":0}]
[{"$f":"'Org structure'!E138","v":0}]
[{"$f":"'Org structure'!E139","v":0}]
[{"$f":"'Org structure'!E140","v":0}]
[{"$f":"'Org structure'!E141","v":0}]
[{"$f":"'Org structure'!E142","v":0}]
[{"$f":"'Org structure'!E143","v":0}]
[{"$f":"'Org structure'!E144","v":0}]
[{"$f":"'Org structure'!A15","v":"Vote 14 - [NAME OF VOTE 14]"},null,{"$f":"SUM(C149:C158)","v":0},{"$f":"SUM(D149:D158)","v":0},0,0,0,0,0,0,0]
[{"$f":"'Org structure'!E146","v":"14.1 - [Name of sub-vote]"}]
[{"$f":"'Org structure'!E147","v":0}]
[{"$f":"'Org structure'!E148","v":0}]
[{"$f":"'Org structure'!E149","v":0}]
[{"$f":"'Org structure'!E150","v":0}]
[{"$f":"'Org structure'!E151","v":0}]
[{"$f":"'Org structure'!E152","v":0}]
[{"$f":"'Org structure'!E153","v":0}]
[{"$f":"'Org structure'!E154","v":0}]
[{"$f":"'Org structure'!E155","v":0}]
[{"$f":"'Org structure'!A16","v":"Vote 15 - [NAME OF VOTE 15]"},null,{"$f":"SUM(C160:C169)","v":0},{"$f":"SUM(D160:D169)","v":0},0,0,0,0,0,0,0]
[{"$f":"'Org structure'!E157","v":"15.1 - [Name of sub-vote]"}]
[{"$f":"'Org structure'!E158","v":0}]
[{"$f":"'Org structure'!E159","v":0}]
[{"$f":"'Org structure'!E160","v":0}]
[{"$f":"'Org structure'!E161","v":0}]
[{"$f":"'Org structure'!E162","v":0}]
[{"$f":"'Org structure'!E163","v":0}]
[{"$f":"'Org structure'!E164","v":0}]
[{"$f":"'Org structure'!E165","v":0}]
[{"$f":"'Org structure'!E166","v":0}]
["Total Revenue by Vote",2,{"$f":"C5+C16+C27+C38+C49+C60+C71+C82+C93+C104+C115+C126+C137+C148+C159","v":179076915},{"$f":"D5+D16+D27+D38+D49+D60+D71+D82+D93+D104+D115+D126+D137+D148+D159","v":209241210},{"$f":"E5+E16+E27+E38+E49+E60+E71+E82+E93+E104+E115+E126+E137+E148+E159","v":217810677},228214996.06,233614996.06,0,{"$f":"I5+I16+I27+I38+I49+I60+I71+I82+I93+I104+I115+I126+I137+I148+I159","v":235209304.90829301},248198712.62941799,267053885.448836,{"$f":"SUM(L78:L81)","v":0},0,0,0,0,0,0,0,0,0,0,0]
[]
["Expenditure by Vote",1]
[{"$f":"A5","v":"Vote 1 - OFFICE OF THE MAYOR"},null,{"$f":"SUM(C174:C183)","v":8850580},7339277,9852522,10955747.869999999,7665110.2199999988,0,7134761.7160999998,7468759.333261,7822118.5765936095]
[{"$f":"A6","v":"1,1 - Office of the mayor"},null,8850580,7339277,9852522,10955747.869999999,7665110.2199999988,null,7134761.7160999998,7468759.333261,7822118.5765936095]
[0]
[0]
[0]
[0]
[0]
[0]
[0]
[0]
[0]
[{"$f":"A16","v":"Vote 2 - OFFICE OF THE SPEAKER"},null,{"$f":"SUM(C185:C194)","v":0},{"$f":"SUM(D185:D194)","v":0},{"$f":"SUM(E185:E194)","v":0},11207928.35,10468823.59,0,10019411.8259,10189730.944159001,10366030.87860059]
[{"$f":"A17","v":"2,1 - Office of the speaker"},null,null,null,null,11207928.35,10468823.59,null,10019411.8259,10189730.944159001,10366030.87860059]
[0]
[0]
[0]
[0]
[0]
[0]
[0]
[0]
[0]
[{"$f":"A27","v":"Vote 3 - OFFICE OF THE MUNICIPAL MANAGER"},null,{"$f":"SUM(C196:C205)","v":2836462},51072147,34468257,49951986.770000003,48391417.079999998,0,45601142.419412002,46470153.843606114,47163074.172042169]
["3,1 - Municipal Manager Administration",null,2836462,51072147,34468257,null,636.86]
["3,2 - Internal Audit",null,null,null,null,970017.81,330000,null,956317.98931200011,982201.16920512018,1009338.7008971714]
["3,3 - PMS/IDP",null,null,null,null,9830256.4700000007,11101554.390000001,null,9761869.9339000005,9917883.633239001,10079019.56457139]
["3,4 - Information Technology",null,null,null,null,3882705.74,4605085.21,null,3137936.0621000002,3314665.4227209999,3502028.4269482098]
["3,5 - Villiers",null,null,null,null,13503259.66,12831755.540000001,null,13008923.095399998,13173182.326353999,13341168.519617539]
["3,6 - Tweeling",null,null,null,null,9033138.2200000007,8071005.5000000009,null,8198615.5549999997,8298961.7105500009,8400784.0776554998]
["3,7 - Cornelia",null,null,null,null,7153707.0300000003,6906447.6000000006,null,6973673.6984999999,7153470.4354849998,7132451.7998398496]
["3,8 - Local Economic Development",null,null,null,null,2461142.06,2197056.73,null,1784902.2972999997,1814736.3202729998,1845599.7684757297]
["3,9 - Town Planning",null,null,null,null,3117759.78,2347875.25,null,1778903.7878999999,1815052.8257790001,1852683.31403679]
[0]
["Vote 4 - COMMUNITY SERVICES",null,{"$f":"SUM(C207:C216)","v":13862071},734536,6818067,13853133.959999999,12587923.659999998,0,11232600.1482,11503281.149682,11786328.616178822]
[{"$f":"A39","v":"4,1 - Enviromental Management"},null,13862071,734536,6818067,12388859.029999999,11444052.799999999,null,10404790.579599999,10645263.485396,10896463.045249961]
["4,2 - Social Development",null,null,null,null,1464274.93,1143870.8599999999,null,827809.5686,858017.66428599996,889865.57092885999]
["4,3 - Local Economic Development"]
[0]
[0]
[0]
[0]
[0]
[0]
[0]
[{"$f":"A49","v":"Vote 5 - CORPORATE SERVICES"},null,{"$f":"SUM(C218:C227)","v":77187777},78362485,85797769,33468537.32,38595767.770000003,0,31108166.696399998,32454293.363364,33877019.041997641]
[{"$f":"A50","v":"5,1 - Administration and Legal"},null,4805168,4502796,6600535,22954789.07,28453255.280000001,null,24707126.342099998,25772237.605521001,26897900.421576209]
["5,2 - Human Resources",null,72382609,73859689,79197234,7310691.1900000004,6939455.4300000006,null,6401040.3542999998,6682055.7578429999,6979118.6204214282]
["5,3 - Property and Ground Management",null,null,null,null,null,0]
["5,4 - Security Services",null,null,null,null,3203057.06,3203057.06]
[0]
[0]
[0]
[0]
[0]
[0]
[{"$f":"A60","v":"Vote 6 - FINANCIAL SERVICES"},null,{"$f":"SUM(C229:C238)","v":181113830},99589241,82117563,29195828.359999999,27445885.049999997,0,70477220.988499999,72022034.526384994,73656876.818626851]
[{"$f":"A61","v":"6,1 - Revenue and Budget Management"},null,181113830,99589241,82117563]
["6,2 - Budget Management"]
["6,3 - Expenditure Management"]
["6,4 - Supply Chain Management"]
["6,5 - Financial Accounting",null,null,null,null,7422443.0599999996,7879940.8099999996,null,42445487.218099996,42589593.590281002,42741377.865653813]
["6,6 - Revenue & Budget",null,null,null,null,15370816.25,13619514.879999999,null,21972705.376800001,23135950.586567998,24368382.855949685]
["6,7 - SCM & Expenditure",null,null,null,null,6402569.0499999998,5946429.3599999994,null,6059028.3936000001,6296490.3495359998,6547116.0970233586]
[0]
[0]
[0]
[{"$f":"A71","v":"Vote 7 - INFRASTRUCTURE SERVICES"},null,{"$f":"SUM(C240:C249)","v":45644013},27082681,48836895,37626068.210000001,46326763.600000009,0,37957705.1241,43022600.175751001,49736477.745943524]
[{"$f":"A72","v":"7,1 - Town Planning"},null,null,null,null,null,0]
["7,2 - Project Management Unit ",null,null,null,null,null,250000,null,250000,250000,265250]
["7,3 - Roads and Stormwater",null,null,null,null,4635533.9800000004,4724230.6000000006,null,4911988.8201000001,6671108.7083010003,8984366.4653840102]
["7,4 - Electricity and Mechanical",null,17199992,6729008,10962325,7494938.2400000002,5723803.0500000007,null,7685341.0805000002,9885494.4913050011,11937082.73621805]
["7,5 - Water and Sanitation",null,12706173,20353673,37874570,24515230.789999999,26123696.109999999,null,24122287.9811,25215988.861320999,27537605.908369221]
["7,6 - Water testing",null,15737848,null,null,null,4006332.38,null,0,0,0]
["7,7 - Pump and Electrical Maintenance",null,null,null,null,null,998700.24,null,988087.24239999999,1000008.114824,1012172.63597224]
[0,null,null,null,null,980365.2,4500001.22]
[0]
[0]
[{"$f":"A82","v":"Vote 8 - SERVICE DELIVERY AND PUBLIC SAFETY"},null,{"$f":"SUM(C251:C260)","v":17326},21833,0,0,0,0,0,0,0]
[{"$f":"A83","v":"8,1 - Villiers"},null,17326]
["8,2 - Tweeling"]
["8,3 - Cornelia"]
["8,4 - Public Safety",null,null,21833]
[0]
[0]
[0]
[0]
[0]
[0]
["Vote 9 - [NAME OF VOTE 9]",null,{"$f":"SUM(C262:C271)","v":0},0,0,0,0,0,0,0,0]
["9.1 - [Name of sub-vote]"]
[0]
[0]
[0]
[0]
[0]
[0]
[0]
[0]
[0]
[{"$f":"A104","v":"Vote 10 - [NAME OF VOTE 10]"},null,{"$f":"SUM(C273:C282)","v":0},0,0,0,0,0,0,0,0]
[{"$f":"A105","v":"10.1 - [Name of sub-vote]"}]
[{"$f":"A106","v":0}]
[0]
[0]
[0]
[0]
[0]
[0]
[0]
[{"$f":"A114","v":0}]
[{"$f":"A115","v":"Vote 11 - [NAME OF VOTE 11]"},null,{"$f":"SUM(C284:C293)","v":0},0,0,0,0,0,0,0,0]
[{"$f":"A116","v":"11.1 - [Name of sub-vote]"}]
[{"$f":"A117","v":0}]
[0]
[0]
[0]
[0]
[0]
[0]
[0]
[0]
["Vote 12 - [NAME OF VOTE 12]",null,{"$f":"SUM(C295:C304)","v":0},0,0,0,0,0,0,0,0]
["12.1 - [Name of sub-vote]"]
[0]
[0]
[0]
[0]
[0]
[0]
[0]
[0]
[0]
["Vote 13 - [NAME OF VOTE 13]",null,{"$f":"SUM(C306:C315)","v":0},0,0,0,0,0,0,0,0]
["13.1 - [Name of sub-vote]"]
[0]
[0]
[0]
[0]
[0]
[0]
[0]
[0]
[0]
["Vote 14 - [NAME OF VOTE 14]",null,{"$f":"SUM(C317:C326)","v":0},0,0,0,0,0,0,0,0]
["14.1 - [Name of sub-vote]"]
[0]
[0]
[0]
[0]
[0]
[0]
[0]
[0]
[0]
["Vote 15 - [NAME OF VOTE 15]",null,{"$f":"SUM(C328:C337)","v":0},0,0,0,0,0,0,0,0]
["15.1 - [Name of sub-vote]"]
[0]
[0]
[0]
[0]
[0]
[0]
[0]
[0]
[0]
["Total Expenditure by Vote",2,{"$f":"C173+C184+C195+C206+C217+C228+C239+C250+C261+C283+C294+C305+C316+C327+C272","v":329512059},{"$f":"D173+D184+D195+D206+D217+D228+D239+D250+D261+D283+D294+D305+D316+D327+D272","v":264202200},{"$f":"E173+E184+E195+E206+E217+E228+E239+E250+E261+E283+E294+E305+E316+E327+E272","v":267891073},186259230.84,191481690.97000003,0,213531008.918612,223130853.33620811,234407925.84998319,{"$f":"SUM(L173:L249)","v":0},0,0,0,0,0,0,0,0,0,0,0]
[]
[{"$f":"result","v":"Surplus/(Deficit) for the year"},2,{"$f":"C170-C338","v":-150435144},-54960990,-50080396,41955765.219999999,42133305.089999974,0,21678295.989681005,25067859.293209881,32645959.598852813,0,0,0,0,0,0,0,0,0,0,0,0]
[{"$f":"head27a","v":"References"}]
["1. Insert 'Vote'; e.g. Department, if different to standard structure"]
["2. Must reconcile to Financial Performance ('Revenue and Expenditure by Standard Classification' and 'Revenue and Expenditure')"]
["3. Assign share in 'associate' to relevant Vote"]
[]
["check revenue",null,{"$f":"C170-'A4-FinPerf RE'!C60","v":0},{"$f":"D170-'A4-FinPerf RE'!D60","v":0},{"$f":"E170-'A4-FinPerf RE'!E60","v":0},{"$f":"F170-'A4-FinPerf RE'!F60","v":6.0000002384185791E-2},{"$f":"G170-'A4-FinPerf RE'!G60","v":6.0000002384185791E-2},{"$f":"H170-'A4-FinPerf RE'!H60","v":-228214996},{"$f":"I170-'A4-FinPerf RE'!J60","v":0},{"$f":"J170-'A4-FinPerf RE'!K60","v":-5.0663948059082031E-7},{"$f":"K170-'A4-FinPerf RE'!L60","v":0}]
["check expenditure",null,{"$f":"C338-'A4-FinPerf RE'!C36","v":-8406545},{"$f":"D338-'A4-FinPerf RE'!D36","v":0},{"$f":"E338-'A4-FinPerf RE'!E36","v":45},{"$f":"F338-'A4-FinPerf RE'!F36","v":-0.54140159487724304},{"$f":"G338-'A4-FinPerf RE'!G36","v":-936.31140154600143},{"$f":"H338-'A4-FinPerf RE'!H36","v":-186259231.3814016},{"$f":"I338-'A4-FinPerf RE'!J36","v":0},{"$f":"J338-'A4-FinPerf RE'!K36","v":0},{"$f":"K338-'A4-FinPerf RE'!L36","v":0}]

{"sheet":"A4-FinPerf RE","index":11,"n_rows":60,"n_cols":24,"rows_kept":60,"cut":false,"hidden":false,"merged":[[1,12,1,23],[1,9,1,11],[1,5,1,8]]}
[{"$f":"muni&\" - \"&Approve4","v":"FS205 Mafube - Table A4 Budgeted Financial Performance (revenue and expenditure)"}]
[{"$f":"desc","v":"Description"},{"$f":"head27","v":"Ref"},{"$f":"head1b","v":"2013/14"},{"$f":"head1A","v":"2014/15"},{"$f":"Head1","v":"2015/16"},{"$f":"Head2","v":"Current Year 2016/17"},null,null,null,{"$f":"Head3","v":"2017/18 Medium Term Revenue & Expenditure Framework"},null,null,{"$f":"Head4","v":"LTFS"}]
["R thousand",1,{"$f":"Head5","v":"Audited Outcome"},{"$f":"Head5","v":"Audited Outcome"},{"$f":"Head5","v":"Audited Outcome"},{"$f":"Head6","v":"Original Budget"},{"$f":"Head7","v":"Adjusted Budget"},{"$f":"Head8","v":"Full Year Forecast"},{"$f":"Head5b","v":"Pre-audit outcome"},{"$f":"Head9","v":"Budget Year 2017/18"},{"$f":"Head10","v":"Budget Year +1 2018/19"},{"$f":"Head11","v":"Budget Year +2 2019/20"},{"$f":"Head12","v":"Forecast 2020/21"},{"$f":"Head13","v":"Forecast 2021/22"},{"$f":"Head14","v":"Forecast 2022/23"},{"$f":"Head15","v":"Forecast 2023/24"},{"$f":"Head16","v":"Forecast 2024/25"},{"$f":"Head17","v":"Forecast 2025/26"},{"$f":"Head18","v":"Forecast 2026/27"},{"$f":"Head19","v":"Forecast 2027/28"},{"$f":"Head20","v":"Forecast 2028/29"},{"$f":"Head21","v":"Forecast 2029/30"},{"$f":"Head22","v":"Forecast 2030/31"},{"$f":"Head23","v":"Forecast 2031/32"}]
["Revenue By Source"]
["Property rates",2,{"$f":"'SA1'!C9","v":19474278},{"$f":"'SA1'!D9","v":21152561},{"$f":"'SA1'!E9","v":22693193},{"$f":"'SA1'!F9","v":27148891},{"$f":"'SA1'!G9","v":27148891},{"$f":"'SA1'!H9","v":27148891},{"$f":"'SA1'!I9","v":0},{"$f":"'SA1'!J9","v":28804972.990260001},{"$f":"'SA1'!K9","v":30562076.3426659},{"$f":"'SA1'!L9","v":32426362.9995685}]
["Property rates - penalties & collection charges"]
["Service charges - electricity revenue",2,{"$f":"'SA1'!C15","v":-102286},{"$f":"'SA1'!D15","v":-414},{"$f":"'SA1'!E15","v":-1376},{"$f":"'SA1'!F15","v":0},{"$f":"'SA1'!G15","v":0},{"$f":"'SA1'!H15","v":0},{"$f":"'SA1'!I15","v":0},{"$f":"'SA1'!J15","v":0},{"$f":"'SA1'!K15","v":0},{"$f":"'SA1'!L15","v":0}]
["Service charges - water revenue",2,{"$f":"'SA1'!C21","v":18518134},{"$f":"'SA1'!D21","v":31294060},{"$f":"'SA1'!E21","v":33858861},{"$f":"'SA1'!F21","v":23098760},{"$f":"'SA1'!G21","v":23098760},{"$f":"'SA1'!H21","v":23098760},{"$f":"'SA1'!I21","v":0},{"$f":"'SA1'!J21","v":24507784.338780001},{"$f":"'SA1'!K21","v":26002759.183445599},{"$f":"'SA1'!L21","v":27588927.4936358}]
["Service charges - sanitation revenue",2,{"$f":"'SA1'!C27","v":15312749},{"$f":"'SA1'!D27","v":16696403},{"$f":"'SA1'!E27","v":17305717},{"$f":"'SA1'!F27","v":17776153},{"$f":"'SA1'!G27","v":17776153},{"$f":"'SA1'!H27","v":17776153},{"$f":"'SA1'!I27","v":0},{"$f":"'SA1'!J27","v":18860498.714960001},{"$f":"'SA1'!K27","v":20010989.136572599},{"$f":"'SA1'!L27","v":21231659.4739035}]
["Service charges - refuse revenue",2,{"$f":"'SA1'!C34","v":13862071},{"$f":"'SA1'!D34","v":12125447},{"$f":"'SA1'!E34","v":12583451},{"$f":"'SA1'!F34","v":12906827},{"$f":"'SA1'!G34","v":12906827},{"$f":"'SA1'!H34","v":12906827},{"$f":"'SA1'!I34","v":0},{"$f":"'SA1'!J34","v":13694143.57432},{"$f":"'SA1'!K34","v":14529486.332353501},{"$f":"'SA1'!L34","v":15415784.9986271}]
["Service charges - other",null,1275172,1346169,1392086,null,0]
["Rental of facilities and equipment",null,543056,435122,136418,291440,291440,291440,null,309217.37188679999,328079.63157189498,348092.48909778002]
["Interest earned - external investments",null,187804,91143,236187,613295,613295,613295,null,214242.96280000001,227311.78353079999,241177.80232617899]
["Interest earned - outstanding debtors",null,12875683,19583954,25817220,25861206,25861206,25861206,null,27412878.280288,29057650.977105301,30801110.035731599]
["Dividends received",null,0,0,0,3342298,3342298,3342298,null,3546177.8172599999,3762494.6641128599,3992006.8386237398]
["Fines",null,73870,119791,75970,750000,150000,750000,null,75000,0,0]
["Licences and permits",null,null,0,0,null,0]
["Agency services"]
["Transfers recognised - operational",null,75524459,83705052,86948674,81524000,87524000,81524000,null,83172000,90157000,95121000]
["Other revenue",2,{"$f":"'SA1'!C49","v":212565},{"$f":"'SA1'!D49","v":2782506},{"$f":"'SA1'!E49","v":4148411},{"$f":"'SA1'!F49","v":2480126},{"$f":"'SA1'!G49","v":2480126},{"$f":"'SA1'!H49","v":2480126},{"$f":"'SA1'!I49","v":0},{"$f":"'SA1'!J49","v":2532388.8577379999},{"$f":"'SA1'!K49","v":2686864.5780600202},{"$f":"'SA1'!L49","v":2850763.31732168}]
["Gains on disposal of PPE",null,0,1401000,-20045,0,0,0]
["Total Revenue (excluding capital transfers and contributions)",null,{"$f":"SUM(C5:C21)","v":157757555},190732794,205174767,195792996,201192996,195792996,0,203129304.9082928,217324712.62941849,230016885.44883588,0,0,0,0,0,0,0,0,0,0,0,0]
[]
["Expenditure By Type"]
["Employee related costs",2,{"$f":"'SA1'!C67","v":77962771},{"$f":"'SA1'!D67","v":73311313},{"$f":"'SA1'!E67","v":77102233},{"$f":"'SA1'!F67","v":87529880.381401584},{"$f":"'SA1'!G67","v":88725940.28140159},{"$f":"'SA1'!H67","v":87529880.381401584},{"$f":"'SA1'!I67","v":0},{"$f":"'SA1'!J67","v":85790600.517562404},{"$f":"'SA1'!K67","v":86648508.04273802},{"$f":"'SA1'!L67","v":87514993.513165414}]
["Remuneration of councillors",null,5235182,4946053,5613522,5926016,5926016,5926016,null,5985276.6044000005,6045129.3704440007,6105580.6641484406]
["Debt impairment",3,37976426,44882190,6569356,1900000,1900000,1900000,null,6569356,6970086.716,7395262.0056759994]
["Depreciation & asset impairment",2,{"$f":"'SA1'!C83","v":137283347},{"$f":"'SA1'!D83","v":37286363},{"$f":"'SA1'!E83","v":38259177},{"$f":"'SA1'!F83","v":1500000},{"$f":"'SA1'!G83","v":1500000},{"$f":"'SA1'!H83","v":1500000},{"$f":"'SA1'!I83","v":0},{"$f":"'SA1'!J83","v":38259177},{"$f":"'SA1'!K83","v":38259177},{"$f":"'SA1'!L83","v":38259177}]
["Finance charges",null,7849642,12101882,21271001,3211126,3211126,3211126,null,3298072,3499254.39,3712708.91]
["Bulk purchases",2,{"$f":"'SA1'!C88","v":27714956},{"$f":"'SA1'!D88","v":23768637},{"$f":"'SA1'!E88","v":45946294},{"$f":"'SA1'!F88","v":6000000},{"$f":"'SA1'!G88","v":6000000},{"$f":"'SA1'!H88","v":6000000},{"$f":"'SA1'!I88","v":0},{"$f":"'SA1'!J88","v":6000000},{"$f":"'SA1'!K88","v":8122000},{"$f":"'SA1'!L88","v":11416420}]
["Other materials",8]
["Contracted services",null,{"$f":"'SA1'!C127","v":0},{"$f":"'SA1'!D127","v":0},{"$f":"'SA1'!E127","v":0},{"$f":"'SA1'!F127","v":0},{"$f":"'SA1'!G127","v":0},{"$f":"'SA1'!H127","v":0},{"$f":"'SA1'!I127","v":0},{"$f":"'SA1'!J127","v":0},{"$f":"'SA1'!K127","v":0},{"$f":"'SA1'!L127","v":0}]
["Transfers and grants",null,{"$f":"'SA1'!C93","v":6746501},{"$f":"'SA1'!D93","v":3547907},{"$f":"'SA1'!E93","v":9595124},{"$f":"'SA1'!F93","v":5252545},{"$f":"'SA1'!G93","v":5252545},{"$f":"'SA1'!H93","v":5252545},{"$f":"'SA1'!I93","v":0},{"$f":"'SA1'!J93","v":10000000},{"$f":"'SA1'!K93","v":10610000},{"$f":"'SA1'!L93","v":11257210}]
["Other expenditure","4, 5",{"$f":"'SA1'!C157","v":37149779},{"$f":"'SA1'!D157","v":64348647},{"$f":"'SA1'!E157","v":63534321},{"$f":"'SA1'!F157","v":74939664},{"$f":"'SA1'!G157","v":78967000},{"$f":"'SA1'!H157","v":74939664},{"$f":"'SA1'!I157","v":0},{"$f":"'SA1'!J157","v":57628526.796649605},{"$f":"'SA1'!K157","v":62976697.817026049},{"$f":"'SA1'!L157","v":68746573.756993353}]
["Loss on disposal of PPE",null,0,9208,0,0,0,0]
["Total Expenditure",null,{"$f":"SUM(C25:C35)","v":337918604},{"$f":"SUM(D25:D35)","v":264202200},267891028,186259231.3814016,191482627.28140157,186259231.3814016,0,213531008.918612,223130853.33620808,234407925.84998319,{"$f":"SUM(M25:M35)","v":0},0,0,0,0,0,0,0,0,0,0,0]
[]
["Surplus/(Deficit)",null,{"$f":"C22-C36","v":-180161049},-73469406,-62716261,9533764.6185984015,9710368.7185984254,9533764.6185984015,0,-10401704.010319203,-5806140.706789583,-4391040.401147306,{"$f":"M22+M36","v":0},0,0,0,0,0,0,0,0,0,0,0]
["Transfers recognised - capital",null,21319360,18508416,12635910,32422000,32422000,32422000,null,32080000,30874000,37037000]
["Contributions recognised - capital",6,{"$f":"'SA1'!C76","v":0},{"$f":"'SA1'!D76","v":0},{"$f":"'SA1'!E76","v":0},{"$f":"'SA1'!F76","v":0},{"$f":"'SA1'!G76","v":0},{"$f":"'SA1'!H76","v":0},{"$f":"'SA1'!I76","v":0},{"$f":"'SA1'!J76","v":0},{"$f":"'SA1'!K76","v":0},{"$f":"'SA1'!L76","v":0}]
["Contributed assets"]
["Surplus/(Deficit) after capital transfers & contributions",null,{"$f":"SUM(C38:C41)","v":-158841689},-54960990,-50080351,41955764.618598402,42132368.718598425,41955764.618598402,0,21678295.989680797,25067859.293210417,32645959.598852694]
["Taxation"]
["Surplus/(Deficit) after taxation",null,{"$f":"C42-C43","v":-158841689},-54960990,-50080351,41955764.618598402,42132368.718598425,41955764.618598402,0,21678295.989680797,25067859.293210417,32645959.598852694]
["Attributable to minorities"]
["Surplus/(Deficit) attributable to municipality",null,{"$f":"SUM(C44:C45)","v":-158841689},-54960990,-50080351,41955764.618598402,42132368.718598425,41955764.618598402,0,21678295.989680797,25067859.293210417,32645959.598852694]
["Share of surplus/ (deficit) of associate",7]
[{"$f":"result","v":"Surplus/(Deficit) for the year"},null,{"$f":"SUM(C46:C47)","v":-158841689},-54960990,-50080351,41955764.618598402,42132368.718598425,41955764.618598402,0,21678295.989680797,25067859.293210417,32645959.598852694,{"$f":"M26+M47","v":0},0,0,0,0,0,0,0,0,0,0,0]
[{"$f":"head27a","v":"References"}]
["1. Classifications are revenue sources and expenditure type"]
["2. Detail to be provided in Table SA1"]
["3. Previously described as 'bad or doubtful debts' - amounts shown should reflect the change in the provision for debt impairment"]
["4. Expenditure type components previously shown under repairs and maintenance should be allocated back to the originating expenditure group/item; e.g. employee costs"]
["5. Repairs & maintenance detailed in Table A9 and Table SA34c"]
["6. Contributions are funds provided by external organisations to assist with infrastructure development; e.g. developer contributions (detail to be provided in Table SA1)"]
["7. Equity method"]
["8. All materials not part of 'bulk' e.g  road making materials, pipe, cable etc."]
["check balance",null,{"$f":"C46-'A3-FinPerf V'!C39","v":-8406545},{"$f":"D46-'A3-FinPerf V'!D39","v":0},{"$f":"E46-'A3-FinPerf V'!E39","v":45},{"$f":"F46-'A3-FinPerf V'!F39","v":-0.60140159726142883},{"$f":"G46-'A3-FinPerf V'!G39","v":-936.37140154838562},{"$f":"H46-'A3-FinPerf V'!H39","v":41955764.618598402},null,{"$f":"J46-'A3-FinPerf V'!I39","v":-2.0861625671386719E-7},{"$f":"K46-'A3-FinPerf V'!J39","v":5.3644180297851563E-7},{"$f":"L46-'A3-FinPerf V'!K39","v":-1.1920928955078125E-7}]
[]
["Total revenue",null,{"$f":"C22+SUM(C39:C41)","v":179076915},209241210,217810677,228214996,233614996,228214996,0,235209304.9082928,248198712.62941849,267053885.44883588]

{"sheet":"A5-Capex","index":12,"n_rows":85,"n_cols":12,"rows_kept":85,"cut":false,"hidden":false,"merged":[[1,9,1,11],[1,5,1,8],[82,0,82,11],[77,0,77,11],[76,0,76,11],[78,0,78,11]]}
[{"$f":"muni&\" - \"&Approve5","v":"FS205 Mafube - Table A5 Budgeted Capital Expenditure by vote, standard classification and funding"}]
[{"$f":"Vdesc","v":"Vote Description"},{"$f":"head27","v":"Ref"},{"$f":"head1b","v":"2013/14"},{"$f":"head1A","v":"2014/15"},{"$f":"Head1","v":"2015/16"},{"$f":"Head2","v":"Current Year 2016/17"},null,null,null,{"$f":"Head3","v":"2017/18 Medium Term Revenue & Expenditure Framework"}]
["R thousand",1,{"$f":"Head5","v":"Audited Outcome"},{"$f":"Head5","v":"Audited Outcome"},{"$f":"Head5","v":"Audited Outcome"},{"$f":"Head6","v":"Original Budget"},{"$f":"Head7","v":"Adjusted Budget"},{"$f":"Head8","v":"Full Year Forecast"},{"$f":"Head5b","v":"Pre-audit outcome"},{"$f":"Head9","v":"Budget Year 2017/18"},{"$f":"Head10","v":"Budget Year +1 2018/19"},{"$f":"Head11","v":"Budget Year +2 2019/20"}]
["Capital expenditure - Vote"]
["Multi-year expenditure  to be appropriated",2]
[{"$f":"A5A!A6","v":"Vote 1 - OFFICE OF THE MAYOR"},null,{"$f":"A5A!C6","v":0},{"$f":"A5A!D6","v":0},{"$f":"A5A!E6","v":0},{"$f":"A5A!F6","v":0},{"$f":"A5A!G6","v":0},{"$f":"A5A!H6","v":0},{"$f":"A5A!I6","v":0},{"$f":"A5A!J6","v":0},{"$f":"A5A!K6","v":0},{"$f":"A5A!L6","v":0}]
[{"$f":"A5A!A17","v":"Vote 2 - OFFICE OF THE SPEAKER"},null,{"$f":"A5A!C17","v":0},{"$f":"A5A!D17","v":0},{"$f":"A5A!E17","v":0},{"$f":"A5A!F17","v":0},{"$f":"A5A!G17","v":0},{"$f":"A5A!H17","v":0},{"$f":"A5A!I17","v":0},{"$f":"A5A!J17","v":0},{"$f":"A5A!K17","v":0},{"$f":"A5A!L17","v":0}]
[{"$f":"A5A!A28","v":"Vote 3 - OFFICE OF THE MUNICIPAL MANAGER"},null,{"$f":"A5A!C28","v":0},{"$f":"A5A!D28","v":0},{"$f":"A5A!E28","v":0},{"$f":"A5A!F28","v":0},{"$f":"A5A!G28","v":0},{"$f":"A5A!H28","v":0},{"$f":"A5A!I28","v":0},{"$f":"A5A!J28","v":0},{"$f":"A5A!K28","v":0},{"$f":"A5A!L28","v":0}]
[{"$f":"A5A!A39","v":"Vote 4 - COMMUNITY SERVICES"},null,{"$f":"A5A!C39","v":0},{"$f":"A5A!D39","v":0},{"$f":"A5A!E39","v":0},{"$f":"A5A!F39","v":0},{"$f":"A5A!G39","v":0},{"$f":"A5A!H39","v":0},{"$f":"A5A!I39","v":0},{"$f":"A5A!J39","v":0},{"$f":"A5A!K39","v":0},{"$f":"A5A!L39","v":0}]
[{"$f":"A5A!A50","v":"Vote 5 - CORPORATE SERVICES"},null,{"$f":"A5A!C50","v":0},{"$f":"A5A!D50","v":0},{"$f":"A5A!E50","v":0},{"$f":"A5A!F50","v":0},{"$f":"A5A!G50","v":0},{"$f":"A5A!H50","v":0},{"$f":"A5A!I50","v":0},{"$f":"A5A!J50","v":0},{"$f":"A5A!K50","v":0},{"$f":"A5A!L50","v":0}]
[{"$f":"A5A!A61","v":"Vote 6 - FINANCIAL SERVICES"},null,{"$f":"A5A!C61","v":0},{"$f":"A5A!D61","v":0},{"$f":"A5A!E61","v":0},{"$f":"A5A!F61","v":0},{"$f":"A5A!G61","v":0},{"$f":"A5A!H61","v":0},{"$f":"A5A!I61","v":0},{"$f":"A5A!J61","v":0},{"$f":"A5A!K61","v":0},{"$f":"A5A!L61","v":0}]
[{"$f":"A5A!A72","v":"Vote 7 - INFRASTRUCTURE SERVICES"},null,{"$f":"A5A!C72","v":0},{"$f":"A5A!D72","v":0},{"$f":"A5A!E72","v":0},{"$f":"A5A!F72","v":0},{"$f":"A5A!G72","v":0},{"$f":"A5A!H72","v":0},{"$f":"A5A!I72","v":0},{"$f":"A5A!J72","v":0},{"$f":"A5A!K72","v":0},{"$f":"A5A!L72","v":0}]
[{"$f":"A5A!A83","v":"Vote 8 - SERVICE DELIVERY AND PUBLIC SAFETY"},null,{"$f":"A5A!C83","v":0},{"$f":"A5A!D83","v":0},{"$f":"A5A!E83","v":0},{"$f":"A5A!F83","v":0},{"$f":"A5A!G83","v":0},{"$f":"A5A!H83","v":0},{"$f":"A5A!I83","v":0},{"$f":"A5A!J83","v":0},{"$f":"A5A!K83","v":0},{"$f":"A5A!L83","v":0}]
[{"$f":"A5A!A94","v":"Vote 9 - [NAME OF VOTE 9]"},null,{"$f":"A5A!C94","v":0},{"$f":"A5A!D94","v":0},{"$f":"A5A!E94","v":0},{"$f":"A5A!F94","v":0},{"$f":"A5A!G94","v":0},{"$f":"A5A!H94","v":0},{"$f":"A5A!I94","v":0},{"$f":"A5A!J94","v":0},{"$f":"A5A!K94","v":0},{"$f":"A5A!L94","v":0}]
[{"$f":"A5A!A105","v":"Vote 10 - [NAME OF VOTE 10]"},null,{"$f":"A5A!C105","v":0},{"$f":"A5A!D105","v":0},{"$f":"A5A!E105","v":0},{"$f":"A5A!F105","v":0},{"$f":"A5A!G105","v":0},{"$f":"A5A!H105","v":0},{"$f":"A5A!I105","v":0},{"$f":"A5A!J105","v":0},{"$f":"A5A!K105","v":0},{"$f":"A5A!L105","v":0}]
[{"$f":"A5A!A116","v":"Vote 11 - [NAME OF VOTE 11]"},null,{"$f":"A5A!C116","v":0},{"$f":"A5A!D116","v":0},{"$f":"A5A!E116","v":0},{"$f":"A5A!F116","v":0},{"$f":"A5A!G116","v":0},{"$f":"A5A!H116","v":0},{"$f":"A5A!I116","v":0},{"$f":"A5A!J116","v":0},{"$f":"A5A!K116","v":0},{"$f":"A5A!L116","v":0}]
[{"$f":"A5A!A127","v":"Vote 12 - [NAME OF VOTE 12]"},null,{"$f":"A5A!C127","v":0},{"$f":"A5A!D127","v":0},{"$f":"A5A!E127","v":0},{"$f":"A5A!F127","v":0},{"$f":"A5A!G127","v":0},{"$f":"A5A!H127","v":0},{"$f":"A5A!I127","v":0},{"$f":"A5A!J127","v":0},{"$f":"A5A!K127","v":0},{"$f":"A5A!L127","v":0}]
[{"$f":"A5A!A138","v":"Vote 13 - [NAME OF VOTE 13]"},null,{"$f":"A5A!C138","v":0},{"$f":"A5A!D138","v":0},{"$f":"A5A!E138","v":0},{"$f":"A5A!F138","v":0},{"$f":"A5A!G138","v":0},{"$f":"A5A!H138","v":0},{"$f":"A5A!I138","v":0},{"$f":"A5A!J138","v":0},{"$f":"A5A!K138","v":0},{"$f":"A5A!L138","v":0}]
[{"$f":"A5A!A149","v":"Vote 14 - [NAME OF VOTE 14]"},null,{"$f":"A5A!C149","v":0},{"$f":"A5A!D149","v":0},{"$f":"A5A!E149","v":0},{"$f":"A5A!F149","v":0},{"$f":"A5A!G149","v":0},{"$f":"A5A!H149","v":0},{"$f":"A5A!I149","v":0},{"$f":"A5A!J149","v":0},{"$f":"A5A!K149","v":0},{"$f":"A5A!L149","v":0}]
[{"$f":"A5A!A160","v":"Vote 15 - [NAME OF VOTE 15]"},null,{"$f":"A5A!C160","v":0},{"$f":"A5A!D160","v":0},{"$f":"A5A!E160","v":0},{"$f":"A5A!F160","v":0},{"$f":"A5A!G160","v":0},{"$f":"A5A!H160","v":0},{"$f":"A5A!I160","v":0},{"$f":"A5A!J160","v":0},{"$f":"A5A!K160","v":0},{"$f":"A5A!L160","v":0}]
["Capital multi-year expenditure sub-total",7,{"$f":"SUM(C6:C20)","v":0},{"$f":"SUM(D6:D20)","v":0},0,0,0,{"$f":"SUM(H6:H20)","v":0},0,0,0,0]
[]
["Single-year expenditure to be appropriated",2]
[{"$f":"A6","v":"Vote 1 - OFFICE OF THE MAYOR"},null,{"$f":"A5A!C175","v":0},{"$f":"A5A!D175","v":0},{"$f":"A5A!E175","v":0},{"$f":"A5A!F175","v":0},{"$f":"A5A!G175","v":0},{"$f":"A5A!H175","v":0},{"$f":"A5A!I175","v":0},{"$f":"A5A!J175","v":0},{"$f":"A5A!K175","v":0},{"$f":"A5A!L175","v":0}]
[{"$f":"A7","v":"Vote 2 - OFFICE OF THE SPEAKER"},null,{"$f":"A5A!C186","v":0},{"$f":"A5A!D186","v":0},{"$f":"A5A!E186","v":0},{"$f":"A5A!F186","v":0},{"$f":"A5A!G186","v":0},{"$f":"A5A!H186","v":0},{"$f":"A5A!I186","v":0},{"$f":"A5A!J186","v":0},{"$f":"A5A!K186","v":0},{"$f":"A5A!L186","v":0}]
["Vote 3 - OFFICE OF THE MUNICIPAL MANAGER",null,{"$f":"A5A!C197","v":0},{"$f":"A5A!D197","v":13293434},{"$f":"A5A!E197","v":8809515},{"$f":"A5A!F197","v":1700000},{"$f":"A5A!G197","v":3320000},{"$f":"A5A!H197","v":0},{"$f":"A5A!I197","v":0},{"$f":"A5A!J197","v":2000000},{"$f":"A5A!K197","v":2122000},{"$f":"A5A!L197","v":2251442}]
["Vote 4 - COMMUNITY SERVICES",null,{"$f":"A5A!C208","v":1528209},{"$f":"A5A!D208","v":789220},{"$f":"A5A!E208","v":222400},{"$f":"A5A!F208","v":4526909},{"$f":"A5A!G208","v":5130854},{"$f":"A5A!H208","v":0},{"$f":"A5A!I208","v":0},{"$f":"A5A!J208","v":7224070.7199999997},{"$f":"A5A!K208","v":1074330},{"$f":"A5A!L208","v":1126665}]
["Vote 5 - CORPORATE SERVICES",null,{"$f":"A5A!C219","v":102885},{"$f":"A5A!D219","v":0},{"$f":"A5A!E219","v":0},{"$f":"A5A!F219","v":2390000},{"$f":"A5A!G219","v":1890000},{"$f":"A5A!H219","v":0},{"$f":"A5A!I219","v":0},{"$f":"A5A!J219","v":0},{"$f":"A5A!K219","v":0},{"$f":"A5A!L219","v":0}]
["Vote 6 - FINANCIAL SERVICES",null,{"$f":"A5A!C230","v":0},{"$f":"A5A!D230","v":0},{"$f":"A5A!E230","v":0},{"$f":"A5A!F230","v":200000},{"$f":"A5A!G230","v":500000},{"$f":"A5A!H230","v":0},{"$f":"A5A!I230","v":0},{"$f":"A5A!J230","v":0},{"$f":"A5A!K230","v":0},{"$f":"A5A!L230","v":0}]
["Vote 7 - INFRASTRUCTURE SERVICES",null,{"$f":"A5A!C241","v":24010930},{"$f":"A5A!D241","v":0},{"$f":"A5A!E241","v":0},{"$f":"A5A!F241","v":33114726},{"$f":"A5A!G241","v":31270781},{"$f":"A5A!H241","v":0},{"$f":"A5A!I241","v":0},{"$f":"A5A!J241","v":23867842.037599999},{"$f":"A5A!K241","v":28799661.885175999},{"$f":"A5A!L241","v":34898162.364027761}]
["Vote 8 - SERVICE DELIVERY AND PUBLIC SAFETY",null,{"$f":"A5A!C252","v":0},{"$f":"A5A!D252","v":0},{"$f":"A5A!E252","v":0},{"$f":"A5A!F252","v":0},{"$f":"A5A!G252","v":0},{"$f":"A5A!H252","v":0},{"$f":"A5A!I252","v":0},{"$f":"A5A!J252","v":0},{"$f":"A5A!K252","v":0},{"$f":"A5A!L252","v":0}]
["Vote 9 - [NAME OF VOTE 9]",null,{"$f":"A5A!C263","v":0},{"$f":"A5A!D263","v":0},{"$f":"A5A!E263","v":0},{"$f":"A5A!F263","v":0},{"$f":"A5A!G263","v":0},{"$f":"A5A!H263","v":0},{"$f":"A5A!I263","v":0},{"$f":"A5A!J263","v":0},{"$f":"A5A!K263","v":0},{"$f":"A5A!L263","v":0}]
["Vote 10 - [NAME OF VOTE 10]",null,{"$f":"A5A!C274","v":0},{"$f":"A5A!D274","v":0},{"$f":"A5A!E274","v":0},{"$f":"A5A!F274","v":0},{"$f":"A5A!G274","v":0},{"$f":"A5A!H274","v":0},{"$f":"A5A!I274","v":0},{"$f":"A5A!J274","v":0},{"$f":"A5A!K274","v":0},{"$f":"A5A!L274","v":0}]
["Vote 11 - [NAME OF VOTE 11]",null,{"$f":"A5A!C285","v":0},{"$f":"A5A!D285","v":0},{"$f":"A5A!E285","v":0},{"$f":"A5A!F285","v":0},{"$f":"A5A!G285","v":0},{"$f":"A5A!H285","v":0},{"$f":"A5A!I285","v":0},{"$f":"A5A!J285","v":0},{"$f":"A5A!K285","v":0},{"$f":"A5A!L285","v":0}]
["Vote 12 - [NAME OF VOTE 12]",null,{"$f":"A5A!C296","v":0},{"$f":"A5A!D296","v":0},{"$f":"A5A!E296","v":0},{"$f":"A5A!F296","v":0},{"$f":"A5A!G296","v":0},{"$f":"A5A!H296","v":0},{"$f":"A5A!I296","v":0},{"$f":"A5A!J296","v":0},{"$f":"A5A!K296","v":0},{"$f":"A5A!L296","v":0}]
["Vote 13 - [NAME OF VOTE 13]",null,{"$f":"A5A!C307","v":0},{"$f":"A5A!D307","v":0},{"$f":"A5A!E307","v":0},{"$f":"A5A!F307","v":0},{"$f":"A5A!G307","v":0},{"$f":"A5A!H307","v":0},{"$f":"A5A!I307","v":0},{"$f":"A5A!J307","v":0},{"$f":"A5A!K307","v":0},{"$f":"A5A!L307","v":0}]
["Vote 14 - [NAME OF VOTE 14]",null,{"$f":"A5A!C318","v":0},{"$f":"A5A!D318","v":0},{"$f":"A5A!E318","v":0},{"$f":"A5A!F318","v":0},{"$f":"A5A!G318","v":0},{"$f":"A5A!H318","v":0},{"$f":"A5A!I318","v":0},{"$f":"A5A!J318","v":0},{"$f":"A5A!K318","v":0},{"$f":"A5A!L318","v":0}]
[{"$f":"A20","v":"Vote 15 - [NAME OF VOTE 15]"},null,{"$f":"A5A!C329","v":0},{"$f":"A5A!D329","v":0},{"$f":"A5A!E329","v":0},{"$f":"A5A!F329","v":0},{"$f":"A5A!G329","v":0},{"$f":"A5A!H329","v":0},{"$f":"A5A!I329","v":0},{"$f":"A5A!J329","v":0},{"$f":"A5A!K329","v":0},{"$f":"A5A!L329","v":0}]
["Capital single-year expenditure sub-total",null,{"$f":"SUM(C24:C38)","v":25642024},{"$f":"SUM(D24:D38)","v":14082654},9031915,41931635,42111635,0,0,33091912.757599998,31995991.885175999,38276269.364027761]
["Total Capital Expenditure - Vote",null,{"$f":"C39+C21","v":25642024},{"$f":"D39+D21","v":14082654},9031915,41931635,42111635,0,0,33091912.757599998,31995991.885175999,38276269.364027761]
[]
["Capital Expenditure - Standard"]
["Governance and administration",null,{"$f":"SUM(C44:C46)","v":102885},{"$f":"SUM(D44:D46)","v":13293434},8809515,4290000,4290000,4290000,0,2000000,2122000,2251442]
["Executive and council",null,null,13293434,8809515,1700000,1700000,1700000,null,2000000,2122000,2251442]
["Budget and treasury office",null,null,null,null,200000,200000,200000]
["Corporate services",null,102885,null,null,2390000,2390000,2390000]
["Community and public safety",null,{"$f":"SUM(C48:C52)","v":1528209},{"$f":"SUM(D48:D52)","v":789220},222400,4526909,4526909,4526909,0,7224070.7199999997,1074330,1126665]
["Community and social services",null,1528209,789220,222400,2200000,2200000,2200000]
["Sport and recreation",null,null,null,null,2326909,2326909,2326909,null,7224070.7199999997,1074330,1126665]
["Public safety"]
["Housing"]
["Health"]
["Economic and environmental services",null,{"$f":"SUM(C54:C56)","v":0},{"$f":"SUM(D54:D56)","v":0},0,0,0,0,0,0,2958082.85,1456380]
["Planning and development"]
["Road transport",null,null,null,null,null,null,null,null,null,2958082.85,1456380]
["Environmental protection"]
["Trading services",null,{"$f":"SUM(C58:C61)","v":0},{"$f":"SUM(D58:D61)","v":0},0,33023991,33023991,33023991,0,23501929.280000001,25647887.149999999,33202105]
["Electricity",null,null,null,null,14000000,14000000,14000000,null,5000000,7000000,12000000]
["Water",null,null,null,null,2251238,2251238,2251238,null,992331.67,10353897.859999999,18580105]
["Waste water management",null,null,null,null,16772753,16772753,16772753,null,17509597.609999999,8293989.29,2622000]
["Waste management",null,null,null,null,null,0]
["Other",null,24010930,null,null,90735,90735,90735,null,365912.76,193691.89,239677.36402775999]
["Total Capital Expenditure - Standard",3,{"$f":"C43+C47+C53+C57+C62","v":25642024},{"$f":"D43+D47+D53+D57+D62","v":14082654},9031915,41931635,41931635,41931635,0,33091912.760000002,31995991.890000001,{"$f":"L43+L47+L53+L57+L62","v":38276269.364027761}]
[]
["Funded by:"]
["National Government",null,null,12656687,8051791,31941635,31941635,31941635,null,31091912.760000002,29873991.890000001,36024827.364027761]
["Provincial Government",null,23341792]
["District Municipality"]
["Other transfers and grants"]
["Transfers recognised - capital",4,{"$f":"SUM(C66:C69)","v":23341792},12656687,8051791,31941635,31941635,31941635,0,31091912.760000002,29873991.890000001,36024827.364027761]
["Public contributions & donations",5]
["Borrowing",6]
["Internally generated funds",null,2300232,1425967,980124,9990000,9990000,9990000,null,2000000,2122000,2251442]
["Total Capital Funding",7,{"$f":"SUM(C70:C73)","v":25642024},14082654,9031915,41931635,41931635,41931635,0,33091912.760000002,31995991.890000001,38276269.364027761]
[{"$f":"head27a","v":"References"}]
["1. Municipalities may choose to appropriate for capital expenditure for three years or for one year (if one year appropriation projected expenditure required for yr2 and yr3)."]
["2. Include capital component of PPP unitary payment. Note that capital transfers are only appropriated to municipalities for the budget year"]
["3. Capital expenditure by standard classification must reconcile to the appropriations by vote"]
["4. Must reconcile to supporting table SA20 and to Budgeted Financial Performance (revenue and expenditure)"]
["5. Must reconcile to Budgeted Financial Performance (revenue and expenditure)"]
["6. Include finance leases and PPP capital funding component of unitary payment - total borrowing/repayments to reconcile to changes in Table SA17"]
["7. Total Capital Funding must balance with Total Capital Expenditure"]
["8. Include any capitalised interest (MFMA section 46) as part of relevant capital budget"]
[]
["check balance",null,{"$f":"IF((C63-C74)=0,0,\"Unbalanced\")","v":0},{"$f":"IF((D63-D74)=0,0,\"Unbalanced\")","v":0},0,0,0,0,0,0,0,0]

{"sheet":"A5A","index":13,"n_rows":341,"n_cols":24,"rows_kept":341,"cut":false,"hidden":false,"merged":[[1,5,1,8],[1,9,1,11],[1,13,1,16],[1,17,1,20],[1,21,1,23]]}
[{"$f":"muni&\" - \"&Approve5","v":"FS205 Mafube - Table A5 Budgeted Capital Expenditure by vote, standard classification and funding"}]
[{"$f":"Vdesc","v":"Vote Description"},{"$f":"head27","v":"Ref"},{"$f":"head1b","v":"2013/14"},{"$f":"head1A","v":"2014/15"},{"$f":"Head1","v":"2015/16"},{"$f":"Head2","v":"Current Year 2016/17"},null,null,null,{"$f":"Head3","v":"2017/18 Medium Term Revenue & Expenditure Framework"},null,null,null,{"$f":"\"Multi-year appropriation for \"&Head9&\n\"\n in the \"&Head2A&\" Annual Budget\"","v":"Multi-year appropriation for Budget Year 2017/18\n in the 2016/17 Annual Budget"},null,null,null,{"$f":"\"Multi-year appropriation for \"&RIGHT(Head10,7)&\n\"\n in the \"&Head2A&\" Annual Budget\"","v":"Multi-year appropriation for 2018/19\n in the 2016/17 Annual Budget"},null,null,null,"New multi-year appropriations \n(funds for new and existing projects) "]
["R thousand",1,{"$f":"Head5","v":"Audited Outcome"},{"$f":"Head5","v":"Audited Outcome"},{"$f":"Head5","v":"Audited Outcome"},{"$f":"Head6","v":"Original Budget"},{"$f":"Head7","v":"Adjusted Budget"},{"$f":"Head8","v":"Full Year Forecast"},{"$f":"Head5b","v":"Pre-audit outcome"},{"$f":"Head9","v":"Budget Year 2017/18"},{"$f":"Head10","v":"Budget Year +1 2018/19"},{"$f":"Head11","v":"Budget Year +2 2019/20"},null,{"$f":"\"Appropriation for \"&RIGHT(Head9,7)","v":"Appropriation for 2017/18"},{"$f":"\"Adjustments in \"&Head2A","v":"Adjustments in 2016/17"},{"$f":"\"Downward adjustments for \"&RIGHT(Head9,7)","v":"Downward adjustments for 2017/18"},"Appropriation carried forward",{"$f":"\"Appropriation for \"&RIGHT(Head9,7)","v":"Appropriation for 2017/18"},{"$f":"\"Adjustments in \"&Head2A","v":"Adjustments in 2016/17"},{"$f":"\"Downward adjustments for \"&RIGHT(Head9,7)","v":"Downward adjustments for 2017/18"},"Appropriation carried forward",{"$f":"Head9","v":"Budget Year 2017/18"},{"$f":"Head10","v":"Budget Year +1 2018/19"},{"$f":"Head11","v":"Budget Year +2 2019/20"}]
["Capital expenditure - Municipal Vote"]
["Multi-year expenditure appropriation",2]
[{"$f":"'Org structure'!A2","v":"Vote 1 - OFFICE OF THE MAYOR"},null,{"$f":"SUM(C7:C16)","v":0},{"$f":"SUM(D7:D16)","v":0},0,0,0,0,{"$f":"SUM(I7:I16)","v":0},0,0,0,null,{"$f":"SUM(N7:N16)","v":0},0,0,0,0,0,0,0,{"$f":"SUM(V7:V16)","v":0},{"$f":"SUM(W7:W16)","v":0},{"$f":"SUM(X7:X16)","v":0}]
[{"$f":"'Org structure'!E3","v":"1,1 - Office of the mayor"},null,null,null,null,null,null,null,null,{"$f":"Q7+V7","v":0},{"$f":"U7+W7","v":0},{"$f":"X7","v":0},null,null,null,null,{"$f":"SUM(N7:P7)","v":0},null,null,null,{"$f":"SUM(R7:T7)","v":0}]
[{"$f":"'Org structure'!E4","v":0},null,null,null,null,null,null,null,null,{"$f":"Q8+V8","v":0},{"$f":"U8+W8","v":0},{"$f":"X8","v":0},null,null,null,null,{"$f":"SUM(N8:P8)","v":0},null,null,null,{"$f":"SUM(R8:T8)","v":0}]
[{"$f":"'Org structure'!E5","v":0},null,null,null,null,null,null,null,null,{"$f":"Q9+V9","v":0},{"$f":"U9+W9","v":0},0,null,null,null,null,0,null,null,null,0]
[{"$f":"'Org structure'!E6","v":0},null,null,null,null,null,null,null,null,0,0,0,null,null,null,null,0,null,null,null,0]
[{"$f":"'Org structure'!E7","v":0},null,null,null,null,null,null,null,null,0,0,{"$f":"X11","v":0},null,null,null,null,0,null,null,null,0]
[{"$f":"'Org structure'!E8","v":0},null,null,null,null,null,null,null,null,0,0,0,null,null,null,null,0,null,null,null,0]
[{"$f":"'Org structure'!E9","v":0},null,null,null,null,null,null,null,null,0,0,0,null,null,null,null,0,null,null,null,0]
[{"$f":"'Org structure'!E10","v":0},null,null,null,null,null,null,null,null,0,0,0,null,null,null,null,0,null,null,null,0]
[{"$f":"'Org structure'!E11","v":0},null,null,null,null,null,null,null,null,0,0,0,null,null,null,null,0,null,null,null,0]
[{"$f":"'Org structure'!E12","v":0},null,null,null,null,null,null,null,null,0,0,0,null,null,null,null,0,null,null,null,0]
[{"$f":"'Org structure'!A3","v":"Vote 2 - OFFICE OF THE SPEAKER"},null,{"$f":"SUM(C18:C27)","v":0},{"$f":"SUM(D18:D27)","v":0},0,0,0,0,{"$f":"SUM(I18:I27)","v":0},0,0,0,null,{"$f":"SUM(N18:N27)","v":0},0,0,0,0,0,0,0,0,0,0]
[{"$f":"'Org structure'!E14","v":"2,1 - Office of the speaker"},null,null,null,null,null,null,null,null,{"$f":"Q18+V18","v":0},{"$f":"U18+W18","v":0},{"$f":"X18","v":0},null,null,null,null,{"$f":"SUM(N18:P18)","v":0},null,null,null,0]
[{"$f":"'Org structure'!E15","v":0},null,null,null,null,null,null,null,null,{"$f":"Q19+V19","v":0},{"$f":"U19+W19","v":0},0,null,null,null,null,0,null,null,null,0]
[{"$f":"'Org structure'!E16","v":0},null,null,null,null,null,null,null,null,0,0,0,null,null,null,null,0,null,null,null,0]
[{"$f":"'Org structure'!E17","v":0},null,null,null,null,null,null,null,null,0,{"$f":"U21+W21","v":0},0,null,null,null,null,0,null,null,null,0]
[{"$f":"'Org structure'!E18","v":0},null,null,null,null,null,null,null,null,0,0,0,null,null,null,null,0,null,null,null,0]
[{"$f":"'Org structure'!E19","v":0},null,null,null,null,null,null,null,null,0,0,0,null,null,null,null,0,null,null,null,0]
[{"$f":"'Org structure'!E20","v":0},null,null,null,null,null,null,null,null,0,0,0,null,null,null,null,0,null,null,null,0]
[{"$f":"'Org structure'!E21","v":0},null,null,null,null,null,null,null,null,0,0,0,null,null,null,null,0,null,null,null,0]
[{"$f":"'Org structure'!E22","v":0},null,null,null,null,null,null,null,null,0,0,0,null,null,null,null,0,null,null,null,0]
[{"$f":"'Org structure'!E23","v":0},null,null,null,null,null,null,null,null,0,0,0,null,null,null,null,0,null,null,null,0]
[{"$f":"'Org structure'!A4","v":"Vote 3 - OFFICE OF THE MUNICIPAL MANAGER"},null,{"$f":"SUM(C29:C38)","v":0},{"$f":"SUM(D29:D38)","v":0},0,0,0,0,{"$f":"SUM(I29:I38)","v":0},0,0,0,null,{"$f":"SUM(N29:N38)","v":0},0,0,0,0,0,0,0,0,0,0]
[{"$f":"'Org structure'!E25","v":"3,1 - Municipal Manager Administration"},null,null,null,null,null,null,null,null,{"$f":"Q29+V29","v":0},{"$f":"U29+W29","v":0},{"$f":"X29","v":0},null,null,null,null,{"$f":"SUM(N29:P29)","v":0},null,null,null,0]
[{"$f":"'Org structure'!E26","v":"3,2 - Internal Audit"},null,null,null,null,null,null,null,null,0,0,0,null,null,null,null,0,null,null,null,0]
[{"$f":"'Org structure'!E27","v":"3,3 - PMS/IDP"},null,null,null,null,null,null,null,null,0,0,0,null,null,null,null,0,null,null,null,{"$f":"SUM(R31:T31)","v":0}]
[{"$f":"'Org structure'!E28","v":"3,4 - Information Technology"},null,null,null,null,null,null,null,null,0,{"$f":"U32+W32","v":0},0,null,null,null,null,0,null,null,null,0]
[{"$f":"'Org structure'!E29","v":"3,5 - Villiers"},null,null,null,null,null,null,null,null,{"$f":"Q33+V33","v":0},0,0,null,null,null,null,0,null,null,null,0]
[{"$f":"'Org structure'!E30","v":"3,6 - Tweeling"},null,null,null,null,null,null,null,null,0,0,0,null,null,null,null,0,null,null,null,0]
[{"$f":"'Org structure'!E31","v":"3,7 - Cornelia"},null,null,null,null,null,null,null,null,0,0,0,null,null,null,null,0,null,null,null,0]
[{"$f":"'Org structure'!E32","v":"3,8 - Local Economic Development"},null,null,null,null,null,null,null,null,0,0,0,null,null,null,null,0,null,null,null,0]
[{"$f":"'Org structure'!E33","v":"3,9 - Town Planning"},null,null,null,null,null,null,null,null,0,0,0,null,null,null,null,0,null,null,null,0]
[{"$f":"'Org structure'!E34","v":0},null,null,null,null,null,null,null,null,0,0,0,null,null,null,null,0,null,null,null,0]
[{"$f":"'Org structure'!A5","v":"Vote 4 - COMMUNITY SERVICES"},null,{"$f":"SUM(C40:C49)","v":0},{"$f":"SUM(D40:D49)","v":0},0,0,0,0,{"$f":"SUM(I40:I49)","v":0},0,0,0,null,{"$f":"SUM(N40:N49)","v":0},0,0,0,0,0,0,0,0,0,0]
[{"$f":"'Org structure'!E36","v":"4,1 - Enviromental Management"},null,null,null,null,null,null,null,null,{"$f":"Q40+V40","v":0},{"$f":"U40+W40","v":0},{"$f":"X40","v":0},null,null,null,null,{"$f":"SUM(N40:P40)","v":0},null,null,null,0]
[{"$f":"'Org structure'!E37","v":"4,2 - Social Development"},null,null,null,null,null,null,null,null,0,0,0,null,null,null,null,0,null,null,null,0]
[{"$f":"'Org structure'!E38","v":"4,3 - Local Economic Development"},null,null,null,null,null,null,null,null,0,0,0,null,null,null,null,0,null,null,null,0]
[{"$f":"'Org structure'!E39","v":0},null,null,null,null,null,null,null,null,0,0,0,null,null,null,null,0,null,null,null,0]
[{"$f":"'Org structure'!E40","v":0},null,null,null,null,null,null,null,null,0,0,0,null,null,null,null,0,null,null,null,0]
[{"$f":"'Org structure'!E41","v":0},null,null,null,null,null,null,null,null,0,0,0,null,null,null,null,0,null,null,null,0]
[{"$f":"'Org structure'!E42","v":0},null,null,null,null,null,null,null,null,0,0,0,null,null,null,null,0,null,null,null,0]
[{"$f":"'Org structure'!E43","v":0},null,null,null,null,null,null,null,null,0,0,0,null,null,null,null,0,null,null,null,0]
[{"$f":"'Org structure'!E44","v":0},null,null,null,null,null,null,null,null,0,0,0,null,null,null,null,0,null,null,null,0]
[{"$f":"'Org structure'!E45","v":0},null,null,null,null,null,null,null,null,0,0,0,null,null,null,null,0,null,null,null,0]
[{"$f":"'Org structure'!A6","v":"Vote 5 - CORPORATE SERVICES"},null,{"$f":"SUM(C51:C60)","v":0},{"$f":"SUM(D51:D60)","v":0},0,0,0,0,{"$f":"SUM(I51:I60)","v":0},0,0,0,null,{"$f":"SUM(N51:N60)","v":0},0,0,0,0,0,0,0,0,0,0]
[{"$f":"'Org structure'!E47","v":"5,1 - Administration and Legal"},null,null,null,null,null,null,null,null,{"$f":"Q51+V51","v":0},{"$f":"U51+W51","v":0},{"$f":"X51","v":0},null,null,null,null,{"$f":"SUM(N51:P51)","v":0},null,null,null,0]
[{"$f":"'Org structure'!E48","v":"5,2 - Human Resources"},null,null,null,null,null,null,null,null,0,0,0,null,null,null,null,0,null,null,null,0]
[{"$f":"'Org structure'!E49","v":"5,3 - Property and Ground Management"},null,null,null,null,null,null,null,null,0,0,0,null,null,null,null,0,null,null,null,0]
[{"$f":"'Org structure'!E50","v":"5,4 - Security Services"},null,null,null,null,null,null,null,null,0,0,0,null,null,null,null,0,null,null,null,0]
[{"$f":"'Org structure'!E51","v":0},null,null,null,null,null,null,null,null,0,0,0,null,null,null,null,0,null,null,null,0]
[{"$f":"'Org structure'!E52","v":0},null,null,null,null,null,null,null,null,0,0,0,null,null,null,null,0,null,null,null,0]
[{"$f":"'Org structure'!E53","v":0},null,null,null,null,null,null,null,null,0,0,0,null,null,null,null,0,null,null,null,0]
[{"$f":"'Org structure'!E54","v":0},null,null,null,null,null,null,null,null,0,0,0,null,null,null,null,0,null,null,null,0]
[{"$f":"'Org structure'!E55","v":0},null,null,null,null,null,null,null,null,0,0,0,null,null,null,null,0,null,null,null,0]
[{"$f":"'Org structure'!E56","v":0},null,null,null,null,null,null,null,null,0,0,0,null,null,null,null,0,null,null,null,0]
[{"$f":"'Org structure'!A7","v":"Vote 6 - FINANCIAL SERVICES"},null,{"$f":"SUM(C62:C71)","v":0},{"$f":"SUM(D62:D71)","v":0},0,0,0,0,{"$f":"SUM(I62:I71)","v":0},0,0,0,null,{"$f":"SUM(N62:N71)","v":0},0,0,0,0,0,0,0,0,0,0]
[{"$f":"'Org structure'!E58","v":"6,1 - Revenue and Budget Management"},null,null,null,null,null,null,null,null,{"$f":"Q62+V62","v":0},{"$f":"U62+W62","v":0},{"$f":"X62","v":0},null,null,null,null,{"$f":"SUM(N62:P62)","v":0},null,null,null,0]
[{"$f":"'Org structure'!E59","v":"6,2 - Budget Management"},null,null,null,null,null,null,null,null,0,0,0,null,null,null,null,0,null,null,null,0]
[{"$f":"'Org structure'!E60","v":"6,3 - Expenditure Management"},null,null,null,null,null,null,null,null,0,0,0,null,null,null,null,0,null,null,null,0]
[{"$f":"'Org structure'!E61","v":"6,4 - Supply Chain Management"},null,null,null,null,null,null,null,null,0,0,0,null,null,null,null,0,null,null,null,0]
[{"$f":"'Org structure'!E62","v":"6,5 - Financial Accounting"},null,null,null,null,null,null,null,null,0,0,0,null,null,null,null,0,null,null,null,0]
[{"$f":"'Org structure'!E63","v":"6,6 - Revenue & Budget"},null,null,null,null,null,null,null,null,0,0,0,null,null,null,null,0,null,null,null,0]
[{"$f":"'Org structure'!E64","v":"6,7 - SCM & Expenditure"},null,null,null,null,null,null,null,null,0,0,0,null,null,null,null,0,null,null,null,0]
[{"$f":"'Org structure'!E65","v":0},null,null,null,null,null,null,null,null,0,0,0,null,null,null,null,0,null,null,null,0]
[{"$f":"'Org structure'!E66","v":0},null,null,null,null,null,null,null,null,0,0,0,null,null,null,null,0,null,null,null,0]
[{"$f":"'Org structure'!E67","v":0},null,null,null,null,null,null,null,null,0,0,0,null,null,null,null,0,null,null,null,0]
[{"$f":"'Org structure'!A8","v":"Vote 7 - INFRASTRUCTURE SERVICES"},null,{"$f":"SUM(C73:C82)","v":0},0,0,0,0,0,0,0,0,0,null,{"$f":"SUM(N73:N82)","v":0},0,0,0,0,0,0,0,0,0,0]
[{"$f":"'Org structure'!E69","v":"7,1 - Town Planning"},null,null,null,null,null,null,null,null,{"$f":"Q73+V73","v":0},{"$f":"U73+W73","v":0},{"$f":"X73","v":0},null,null,null,null,{"$f":"SUM(N73:P73)","v":0},null,null,null,{"$f":"SUM(R73:T73)","v":0}]
[{"$f":"'Org structure'!E70","v":"7,2 - Project Management Unit "},null,null,null,null,null,null,null,null,0,0,0,null,null,null,null,0,null,null,null,0]
[{"$f":"'Org structure'!E71","v":"7,3 - Roads and Stormwater"},null,null,null,null,null,null,null,null,0,0,0,null,null,null,null,0,null,null,null,0]
[{"$f":"'Org structure'!E72","v":"7,4 - Electricity and Mechanical"},null,null,null,null,null,null,null,null,0,0,0,null,null,null,null,0,null,null,null,0]
[{"$f":"'Org structure'!E73","v":"7,5 - Water and Sanitation"},null,null,null,null,null,null,null,null,0,0,0,null,null,null,null,0,null,null,null,0]
[{"$f":"'Org structure'!E74","v":"7,6 - Water testing"},null,null,null,null,null,null,null,null,0,0,0,null,null,null,null,0,null,null,null,0]
[{"$f":"'Org structure'!E75","v":"7,7 - Pump and Electrical Maintenance"},null,null,null,null,null,null,null,null,0,0,0,null,null,null,null,0,null,null,null,0]
[{"$f":"'Org structure'!E76","v":0},null,null,null,null,null,null,null,null,0,0,0,null,null,null,null,0,null,null,null,0]
[{"$f":"'Org structure'!E77","v":0},null,null,null,null,null,null,null,null,0,0,0,null,null,null,null,0,null,null,null,0]
[{"$f":"'Org structure'!E78","v":0},null,null,null,null,null,null,null,null,0,0,0,null,null,null,null,0,null,null,null,0]
[{"$f":"'Org structure'!A9","v":"Vote 8 - SERVICE DELIVERY AND PUBLIC SAFETY"},null,{"$f":"SUM(C84:C93)","v":0},0,0,0,0,0,0,0,0,0,null,{"$f":"SUM(N84:N93)","v":0},0,0,0,0,0,0,0,0,0,0]
[{"$f":"'Org structure'!E80","v":"8,1 - Villiers"},null,null,null,null,null,null,null,null,{"$f":"Q84+V84","v":0},{"$f":"U84+W84","v":0},{"$f":"X84","v":0},null,null,null,null,{"$f":"SUM(N84:P84)","v":0},null,null,null,0]
[{"$f":"'Org structure'!E81","v":"8,2 - Tweeling"},null,null,null,null,null,null,null,null,0,0,0,null,null,null,null,0,null,null,null,0]
[{"$f":"'Org structure'!E82","v":"8,3 - Cornelia"},null,null,null,null,null,null,null,null,0,0,0,null,null,null,null,0,null,null,null,0]
[{"$f":"'Org structure'!E83","v":"8,4 - Public Safety"},null,null,null,null,null,null,null,null,0,0,0,null,null,null,null,0,null,null,null,0]
[{"$f":"'Org structure'!E84","v":0},null,null,null,null,null,null,null,null,0,0,0,null,null,null,null,0,null,null,null,0]
[{"$f":"'Org structure'!E85","v":0},null,null,null,null,null,null,null,null,0,0,0,null,null,null,null,0,null,null,null,0]
[{"$f":"'Org structure'!E86","v":0},null,null,null,null,null,null,null,null,0,0,0,null,null,null,null,0,null,null,null,0]
[{"$f":"'Org structure'!E87","v":0},null,null,null,null,null,null,null,null,0,0,0,null,null,null,null,0,null,null,null,0]
[{"$f":"'Org structure'!E88","v":0},null,null,null,null,null,null,null,null,0,0,0,null,null,null,null,0,null,null,null,0]
[{"$f":"'Org structure'!E89","v":0},null,null,null,null,null,null,null,null,0,0,0,null,null,null,null,0,null,null,null,0]
[{"$f":"'Org structure'!A10","v":"Vote 9 - [NAME OF VOTE 9]"},null,{"$f":"SUM(C95:C104)","v":0},{"$f":"SUM(D95:D104)","v":0},0,0,0,0,0,0,0,0,null,{"$f":"SUM(N95:N104)","v":0},0,0,0,0,0,0,0,0,0,0]
[{"$f":"'Org structure'!E91","v":"9.1 - [Name of sub-vote]"},null,null,null,null,null,null,null,null,{"$f":"Q95+V95","v":0},{"$f":"U95+W95","v":0},{"$f":"X95","v":0},null,null,null,null,{"$f":"SUM(N95:P95)","v":0},null,null,null,0]
[{"$f":"'Org structure'!E92","v":0},null,null,null,null,null,null,null,null,0,0,0,null,null,null,null,0,null,null,null,0]
[{"$f":"'Org structure'!E93","v":0},null,null,null,null,null,null,null,null,0,0,0,null,null,null,null,0,null,null,null,0]
[{"$f":"'Org structure'!E94","v":0},null,null,null,null,null,null,null,null,0,0,0,null,null,null,null,0,null,null,null,0]
[{"$f":"'Org structure'!E95","v":0},null,null,null,null,null,null,null,null,0,0,0,null,null,null,null,0,null,null,null,0]
[{"$f":"'Org structure'!E96","v":0},null,null,null,null,null,null,null,null,0,0,0,null,null,null,null,0,null,null,null,0]
[{"$f":"'Org structure'!E97","v":0},null,null,null,null,null,null,null,null,0,0,0,null,null,null,null,0,null,null,null,0]
[{"$f":"'Org structure'!E98","v":0},null,null,null,null,null,null,null,null,0,0,0,null,null,null,null,0,null,null,null,0]
[{"$f":"'Org structure'!E99","v":0},null,null,null,null,null,null,null,null,0,0,0,null,null,null,null,0,null,null,null,0]
[{"$f":"'Org structure'!E100","v":0},null,null,null,null,null,null,null,null,0,0,0,null,null,null,null,0,null,null,null,0]
[{"$f":"'Org structure'!A11","v":"Vote 10 - [NAME OF VOTE 10]"},null,{"$f":"SUM(C106:C115)","v":0},{"$f":"SUM(D106:D115)","v":0},0,0,0,0,0,0,0,0,null,{"$f":"SUM(N106:N115)","v":0},0,0,0,0,0,0,0,0,0,0]
[{"$f":"'Org structure'!E102","v":"10.1 - [Name of sub-vote]"},null,null,null,null,null,null,null,null,{"$f":"Q106+V106","v":0},{"$f":"U106+W106","v":0},{"$f":"X106","v":0},null,null,null,null,{"$f":"SUM(N106:P106)","v":0},null,null,null,0]
[{"$f":"'Org structure'!E103","v":0},null,null,null,null,null,null,null,null,0,0,0,null,null,null,null,0,null,null,null,0]
[{"$f":"'Org structure'!E104","v":0},null,null,null,null,null,null,null,null,0,0,0,null,null,null,null,0,null,null,null,0]
[{"$f":"'Org structure'!E105","v":0},null,null,null,null,null,null,null,null,0,0,0,null,null,null,null,0,null,null,null,0]
[{"$f":"'Org structure'!E106","v":0},null,null,null,null,null,null,null,null,0,0,0,null,null,null,null,0,null,null,null,0]
[{"$f":"'Org structure'!E107","v":0},null,null,null,null,null,null,null,null,0,0,0,null,null,null,null,0,null,null,null,0]
[{"$f":"'Org structure'!E108","v":0},null,null,null,null,null,null,null,null,0,0,0,null,null,null,null,0,null,null,null,0]
[{"$f":"'Org structure'!E109","v":0},null,null,null,null,null,null,null,null,0,0,0,null,null,null,null,0,null,null,null,0]
[{"$f":"'Org structure'!E110","v":0},null,null,null,null,null,null,null,null,0,0,0,null,null,null,null,0,null,null,null,0]
[{"$f":"'Org structure'!E111","v":0},null,null,null,null,null,null,null,null,0,0,0,null,null,null,null,0,null,null,null,0]
[{"$f":"'Org structure'!A12","v":"Vote 11 - [NAME OF VOTE 11]"},null,{"$f":"SUM(C117:C126)","v":0},0,0,0,0,0,0,0,0,0,null,{"$f":"SUM(N117:N126)","v":0},0,0,0,0,0,0,0,0,0,0]
[{"$f":"'Org structure'!E113","v":"11.1 - [Name of sub-vote]"},null,null,null,null,null,null,null,null,{"$f":"Q117+V117","v":0},{"$f":"U117+W117","v":0},{"$f":"X117","v":0},null,null,null,null,{"$f":"SUM(N117:P117)","v":0},null,null,null,0]
[{"$f":"'Org structure'!E114","v":0},null,null,null,null,null,null,null,null,0,0,0,null,null,null,null,0,null,null,null,0]
[{"$f":"'Org structure'!E115","v":0},null,null,null,null,null,null,null,null,0,0,0,null,null,null,null,0,null,null,null,0]
[{"$f":"'Org structure'!E116","v":0},null,null,null,null,null,null,null,null,0,0,0,null,null,null,null,0,null,null,null,0]
[{"$f":"'Org structure'!E117","v":0},null,null,null,null,null,null,null,null,0,0,0,null,null,null,null,0,null,null,null,0]
[{"$f":"'Org structure'!E118","v":0},null,null,null,null,null,null,null,null,0,0,0,null,null,null,null,0,null,null,null,0]
[{"$f":"'Org structure'!E119","v":0},null,null,null,null,null,null,null,null,0,0,0,null,null,null,null,0,null,null,null,0]
[{"$f":"'Org structure'!E120","v":0},null,null,null,null,null,null,null,null,0,0,0,null,null,null,null,0,null,null,null,0]
[{"$f":"'Org structure'!E121","v":0},null,null,null,null,null,null,null,null,0,0,0,null,null,null,null,0,null,null,null,0]
[{"$f":"'Org structure'!E122","v":0},null,null,null,null,null,null,null,null,0,0,0,null,null,null,null,0,null,null,null,0]
[{"$f":"'Org structure'!A13","v":"Vote 12 - [NAME OF VOTE 12]"},null,{"$f":"SUM(C128:C137)","v":0},0,0,0,0,0,0,0,0,0,null,{"$f":"SUM(N128:N137)","v":0},0,0,0,0,0,0,0,0,0,0]
[{"$f":"'Org structure'!E124","v":"12.1 - [Name of sub-vote]"},null,null,null,null,null,null,null,null,{"$f":"Q128+V128","v":0},{"$f":"U128+W128","v":0},{"$f":"X128","v":0},null,null,null,null,{"$f":"SUM(N128:P128)","v":0},null,null,null,0]
[{"$f":"'Org structure'!E125","v":0},null,null,null,null,null,null,null,null,0,0,0,null,null,null,null,0,null,null,null,0]
[{"$f":"'Org structure'!E126","v":0},null,null,null,null,null,null,null,null,0,0,0,null,null,null,null,0,null,null,null,0]
[{"$f":"'Org structure'!E127","v":0},null,null,null,null,null,null,null,null,0,0,0,null,null,null,null,0,null,null,null,0]
[{"$f":"'Org structure'!E128","v":0},null,null,null,null,null,null,null,null,0,0,0,null,null,null,null,0,null,null,null,0]
[{"$f":"'Org structure'!E129","v":0},null,null,null,null,null,null,null,null,{"$f":"Q133+V133","v":0},0,0,null,null,null,null,0,null,null,null,0]
[{"$f":"'Org structure'!E130","v":0},null,null,null,null,null,null,null,null,0,0,0,null,null,null,null,0,null,null,null,0]
[{"$f":"'Org structure'!E131","v":0},null,null,null,null,null,null,null,null,0,0,0,null,null,null,null,0,null,null,null,0]
[{"$f":"'Org structure'!E132","v":0},null,null,null,null,null,null,null,null,0,0,0,null,null,null,null,0,null,null,null,{"$f":"SUM(R136:T136)","v":0}]
[{"$f":"'Org structure'!E133","v":0},null,null,null,null,null,null,null,null,0,0,0,null,null,null,null,0,null,null,null,0]
[{"$f":"'Org structure'!A14","v":"Vote 13 - [NAME OF VOTE 13]"},null,{"$f":"SUM(C139:C148)","v":0},0,0,0,0,0,0,0,0,0,null,{"$f":"SUM(N139:N148)","v":0},0,0,0,0,0,0,0,0,0,0]
[{"$f":"'Org structure'!E135","v":"13.1 - [Name of sub-vote]"},null,null,null,null,null,null,null,null,{"$f":"Q139+V139","v":0},{"$f":"U139+W139","v":0},{"$f":"X139","v":0},null,null,null,null,{"$f":"SUM(N139:P139)","v":0},null,null,null,0]
[{"$f":"'Org structure'!E136","v":0},null,null,null,null,null,null,null,null,0,0,0,null,null,null,null,0,null,null,null,0]
[{"$f":"'Org structure'!E137","v":0},null,null,null,null,null,null,null,null,0,0,0,null,null,null,null,0,null,null,null,0]
[{"$f":"'Org structure'!E138","v":0},null,null,null,null,null,null,null,null,0,0,0,null,null,null,null,0,null,null,null,0]
[{"$f":"'Org structure'!E139","v":0},null,null,null,null,null,null,null,null,0,0,0,null,null,null,null,0,null,null,null,0]
[{"$f":"'Org structure'!E140","v":0},null,null,null,null,null,null,null,null,0,0,0,null,null,null,null,0,null,null,null,0]
[{"$f":"'Org structure'!E141","v":0},null,null,null,null,null,null,null,null,0,0,0,null,null,null,null,0,null,null,null,0]
[{"$f":"'Org structure'!E142","v":0},null,null,null,null,null,null,null,null,0,0,0,null,null,null,null,0,null,null,null,0]
[{"$f":"'Org structure'!E143","v":0},null,null,null,null,null,null,null,null,0,0,0,null,null,null,null,0,null,null,null,0]
[{"$f":"'Org structure'!E144","v":0},null,null,null,null,null,null,null,null,0,0,0,null,null,null,null,0,null,null,null,0]
[{"$f":"'Org structure'!A15","v":"Vote 14 - [NAME OF VOTE 14]"},null,{"$f":"SUM(C150:C159)","v":0},0,0,0,0,0,0,0,0,0,null,{"$f":"SUM(N150:N159)","v":0},0,0,0,0,0,0,0,0,0,0]
[{"$f":"'Org structure'!E146","v":"14.1 - [Name of sub-vote]"},null,null,null,null,null,null,null,null,{"$f":"Q150+V150","v":0},{"$f":"U150+W150","v":0},{"$f":"X150","v":0},null,null,null,null,{"$f":"SUM(N150:P150)","v":0},null,null,null,0]
[{"$f":"'Org structure'!E147","v":0},null,null,null,null,null,null,null,null,0,0,0,null,null,null,null,0,null,null,null,0]
[{"$f":"'Org structure'!E148","v":0},null,null,null,null,null,null,null,null,0,0,0,null,null,null,null,0,null,null,null,0]
[{"$f":"'Org structure'!E149","v":0},null,null,null,null,null,null,null,null,0,0,0,null,null,null,null,0,null,null,null,0]
[{"$f":"'Org structure'!E150","v":0},null,null,null,null,null,null,null,null,0,0,0,null,null,null,null,0,null,null,null,0]
[{"$f":"'Org structure'!E151","v":0},null,null,null,null,null,null,null,null,0,0,0,null,null,null,null,0,null,null,null,0]
[{"$f":"'Org structure'!E152","v":0},null,null,null,null,null,null,null,null,0,0,0,null,null,null,null,0,null,null,null,0]
[{"$f":"'Org structure'!E153","v":0},null,null,null,null,null,null,null,null,0,0,0,null,null,null,null,0,null,null,null,0]
[{"$f":"'Org structure'!E154","v":0},null,null,null,null,null,null,null,null,0,0,0,null,null,null,null,0,null,null,null,0]
[{"$f":"'Org structure'!E155","v":0},null,null,null,null,null,null,null,null,0,0,0,null,null,null,null,0,null,null,null,0]
[{"$f":"'Org structure'!A16","v":"Vote 15 - [NAME OF VOTE 15]"},null,{"$f":"SUM(C161:C170)","v":0},0,0,0,0,0,0,0,0,0,null,{"$f":"SUM(N161:N170)","v":0},0,0,0,0,0,0,0,0,0,0]
[{"$f":"'Org structure'!E157","v":"15.1 - [Name of sub-vote]"},null,null,null,null,null,null,null,null,{"$f":"Q161+V161","v":0},{"$f":"U161+W161","v":0},{"$f":"X161","v":0},null,null,null,null,{"$f":"SUM(N161:P161)","v":0},null,null,null,0]
[{"$f":"'Org structure'!E158","v":0},null,null,null,null,null,null,null,null,0,0,0,null,null,null,null,0,null,null,null,0]
[{"$f":"'Org structure'!E159","v":0},null,null,null,null,null,null,null,null,0,0,0,null,null,null,null,0,null,null,null,0]
[{"$f":"'Org structure'!E160","v":0},null,null,null,null,null,null,null,null,0,0,0,null,null,null,null,0,null,null,null,0]
[{"$f":"'Org structure'!E161","v":0},null,null,null,null,null,null,null,null,0,0,0,null,null,null,null,0,null,null,null,0]
[{"$f":"'Org structure'!E162","v":0},null,null,null,null,null,null,null,null,0,0,0,null,null,null,null,0,null,null,null,0]
[{"$f":"'Org structure'!E163","v":0},null,null,null,null,null,null,null,null,0,0,0,null,null,null,null,0,null,null,null,0]
[{"$f":"'Org structure'!E164","v":0},null,null,null,null,null,null,null,null,0,0,0,null,null,null,null,0,null,null,null,0]
[{"$f":"'Org structure'!E165","v":0},null,null,null,null,null,null,null,null,0,0,0,null,null,null,null,0,null,null,null,0]
[{"$f":"'Org structure'!E166","v":0},null,null,null,null,null,null,null,null,0,0,0,null,null,null,null,0,null,null,null,0]
["Capital multi-year expenditure sub-total",null,{"$f":"C6+C17+C28+C39+C50+C61+C72+C83+C94+C105+C116+C127+C138+C149+C160","v":0},{"$f":"D6+D17+D28+D39+D50+D61+D72+D83+D94+D105+D116+D127+D138+D149+D160","v":0},0,0,0,0,0,0,0,0,null,{"$f":"N6+N17+N28+N39+N50+N61+N72+N83+N94+N105+N116+N127+N138+N149+N160","v":0},0,0,0,0,0,null,0,{"$f":"V6+V17+V28+V39+V50+V61+V72+V83+V94+V105+V116+V127+V138+V149+V160","v":0},{"$f":"W6+W17+W28+W39+W50+W61+W72+W83+W94+W105+W116+W127+W138+W149+W160","v":0}]
[]
["Capital expenditure - Municipal Vote"]
["Single-year expenditure appropriation",2]
[{"$f":"A6","v":"Vote 1 - OFFICE OF THE MAYOR"},null,{"$f":"SUM(C176:C185)","v":0},0,0,0,0,0,0,0,0,0]
[{"$f":"A7","v":"1,1 - Office of the mayor"}]
[0]
[0]
[0]
[0]
[0]
[0]
[0]
[0]
[0]
["Vote 2 - OFFICE OF THE SPEAKER",null,{"$f":"SUM(C187:C196)","v":0},0,0,0,0,0,0,0,0,0]
["2,1 - Office of the speaker"]
[0]
[0]
[0]
[0]
[0]
[0]
[0]
[0]
[0]
["Vote 3 - OFFICE OF THE MUNICIPAL MANAGER",null,{"$f":"SUM(C198:C207)","v":0},13293434,8809515,1700000,3320000,0,0,2000000,2122000,2251442]
["3,1 - Municipal Manager Administration",null,null,13293434,8809515]
["3,2 - Internal Audit"]
["3,3 - PMS/IDP"]
["3,4 - Information Technology",null,null,null,null,1700000,3320000,null,null,2000000,2122000,2251442]
["3,5 - Villiers"]
["3,6 - Tweeling"]
["3,7 - Cornelia"]
["3,8 - Local Economic Development"]
["3,9 - Town Planning"]
[0]
["Vote 4 - COMMUNITY SERVICES",null,{"$f":"SUM(C209:C218)","v":1528209},789220,222400,4526909,5130854,0,0,7224070.7199999997,1074330,1126665]
["4,1 - Enviromental Management",null,1528209,789220,222400,2200000,960000]
["4,2 - Social Development",null,null,null,null,2326909,4170854,null,null,7224070.7199999997,1074330,1126665]
["4,3 - Local Economic Development"]
[0]
[0]
[0]
[0]
[0]
[0]
[0]
["Vote 5 - CORPORATE SERVICES",null,{"$f":"SUM(C220:C229)","v":102885},0,0,2390000,1890000,0,0,0,0,0]
["5,1 - Administration and Legal",null,102885,null,null,2390000,1890000]
["5,2 - Human Resources"]
["5,3 - Property and Ground Management"]
["5,4 - Security Services"]
[0]
[0]
[0]
[0]
[0]
[0]
["Vote 6 - FINANCIAL SERVICES",null,{"$f":"SUM(C231:C240)","v":0},0,0,200000,500000,0,0,0,0,0]
["6,1 - Revenue and Budget Management"]
["6,2 - Budget Management"]
["6,3 - Expenditure Management"]
["6,4 - Supply Chain Management"]
["6,5 - Financial Accounting",null,null,null,null,200000,500000]
["6,6 - Revenue & Budget"]
["6,7 - SCM & Expenditure"]
[0]
[0]
[{"$f":"A71","v":0}]
["Vote 7 - INFRASTRUCTURE SERVICES",null,{"$f":"SUM(C242:C251)","v":24010930},0,0,33114726,31270781,0,0,23867842.037599999,28799661.885175999,34898162.364027761]
["7,1 - Town Planning",null,null,null,null,null,0]
["7,2 - Project Management Unit ",null,24010930,null,null,null,0]
["7,3 - Roads and Stormwater",null,null,null,null,null,0,null,null,0,2958082.85,1456380]
["7,4 - Electricity and Mechanical",null,null,null,null,14000000,14000000,null,null,5000000,7000000,12000000]
["7,5 - Water and Sanitation",null,null,null,null,19023991,17180046,null,null,18501929.280000001,18647887.149999999,21202105]
["7,6 - Water testing",null,null,null,null,null,0]
["7,7 - Pump and Electrical Maintenance",null,null,null,null,90735,90735,null,null,365912.75760000001,193691.88517599995,239677.36402775999]
[0,null,null,null,null,null,0]
[0]
[0]
["Vote 8 - SERVICE DELIVERY AND PUBLIC SAFETY",null,{"$f":"SUM(C253:C262)","v":0},0,0,0,0,0,0,0,0,0]
["8,1 - Villiers"]
["8,2 - Tweeling"]
["8,3 - Cornelia"]
["8,4 - Public Safety"]
[0]
[0]
[0]
[0]
[0]
[0]
["Vote 9 - [NAME OF VOTE 9]",null,{"$f":"SUM(C264:C273)","v":0},0,0,0,0,0,0,0,0,0]
["9.1 - [Name of sub-vote]"]
[0]
[0]
[0]
[0]
[0]
[0]
[0]
[0]
[0]
["Vote 10 - [NAME OF VOTE 10]",null,{"$f":"SUM(C275:C284)","v":0},0,0,0,0,0,0,0,0,0]
["10.1 - [Name of sub-vote]"]
[0]
[0]
[0]
[0]
[0]
[0]
[0]
[0]
[0]
["Vote 11 - [NAME OF VOTE 11]",null,{"$f":"SUM(C286:C295)","v":0},0,0,0,0,0,0,0,0,0]
["11.1 - [Name of sub-vote]"]
[0]
[0]
[0]
[0]
[0]
[0]
[0]
[0]
[0]
["Vote 12 - [NAME OF VOTE 12]",null,{"$f":"SUM(C297:C306)","v":0},0,0,0,0,0,0,0,0,0]
["12.1 - [Name of sub-vote]"]
[0]
[0]
[0]
[0]
[0]
[0]
[{"$f":"A135","v":0}]
[0]
[0]
["Vote 13 - [NAME OF VOTE 13]",null,{"$f":"SUM(C308:C317)","v":0},0,0,0,0,0,0,0,0,0]
["13.1 - [Name of sub-vote]"]
[0]
[0]
[0]
[0]
[0]
[0]
[0]
[0]
[0]
["Vote 14 - [NAME OF VOTE 14]",null,{"$f":"SUM(C319:C328)","v":0},0,0,0,0,0,0,0,0,0]
["14.1 - [Name of sub-vote]"]
[0]
[0]
[0]
[0]
[0]
[0]
[0]
[0]
[0]
["Vote 15 - [NAME OF VOTE 15]",null,{"$f":"SUM(C330:C339)","v":0},0,0,0,0,0,0,0,0,0]
["15.1 - [Name of sub-vote]"]
[0]
[0]
[0]
[0]
[0]
[0]
[0]
[0]
[0]
["Capital single-year expenditure sub-total",null,{"$f":"C175+C186+C197+C208+C219+C230+C241+C252+C263+C274+C285+C296+C307+C318+C329","v":25642024},{"$f":"D175+D186+D197+D208+D219+D230+D241+D252+D263+D274+D285+D296+D307+D318+D329","v":14082654},9031915,41931635,42111635,0,0,33091912.757599998,31995991.885175999,38276269.364027761]
["Total Capital Expenditure",null,{"$f":"C171+C340","v":25642024},{"$f":"D171+D340","v":14082654},9031915,41931635,42111635,0,0,33091912.757599998,31995991.885175999,38276269.364027761]

{"sheet":"A6-FinPos","index":14,"n_rows":71,"n_cols":12,"rows_kept":71,"cut":false,"hidden":false,"merged":[[49,0,49,11],[1,9,1,11],[1,5,1,8]]}
[{"$f":"muni&\" - \"&Approve6","v":"FS205 Mafube - Table A6 Budgeted Financial Position"}]
[{"$f":"desc","v":"Description"},{"$f":"head27","v":"Ref"},{"$f":"head1b","v":"2013/14"},{"$f":"head1A","v":"2014/15"},{"$f":"Head1","v":"2015/16"},{"$f":"Head2","v":"Current Year 2016/17"},null,null,null,{"$f":"Head3","v":"2017/18 Medium Term Revenue & Expenditure Framework"}]
["R thousand",null,{"$f":"Head5","v":"Audited Outcome"},{"$f":"Head5","v":"Audited Outcome"},{"$f":"Head5","v":"Audited Outcome"},{"$f":"Head6","v":"Original Budget"},{"$f":"Head7","v":"Adjusted Budget"},{"$f":"Head8","v":"Full Year Forecast"},{"$f":"Head5b","v":"Pre-audit outcome"},{"$f":"Head9","v":"Budget Year 2017/18"},{"$f":"Head10","v":"Budget Year +1 2018/19"},{"$f":"Head11","v":"Budget Year +2 2019/20"}]
["ASSETS"]
["Current assets"]
["Cash",null,64367,591083,87055,28845,28845,28845,4506044,28845,28845,28845]
["Call investment deposits",1,{"$f":"'SA3'!C9","v":31415},{"$f":"'SA3'!D9","v":28845},{"$f":"'SA3'!E9","v":548289},{"$f":"'SA3'!F9","v":591083},{"$f":"'SA3'!G9","v":591083},{"$f":"'SA3'!H9","v":591083},{"$f":"'SA3'!I9","v":0},{"$f":"'SA3'!J9","v":591083},{"$f":"'SA3'!K9","v":591083},{"$f":"'SA3'!L9","v":591083}]
["Consumer debtors",1,{"$f":"'SA3'!C14","v":35926954},{"$f":"'SA3'!D14","v":63954782},{"$f":"'SA3'!E14","v":120617069},{"$f":"'SA3'!F14","v":63954782},{"$f":"'SA3'!G14","v":61921782},{"$f":"'SA3'!H14","v":61921782},{"$f":"'SA3'!I14","v":7017918},{"$f":"'SA3'!J14","v":63221782},{"$f":"'SA3'!K14","v":63221782},{"$f":"'SA3'!L14","v":63221782}]
["Other debtors",null,7354697,11283210,22713494,11283210,11283210,11283210,-3000,11283210,11283210,11283210]
["Current portion of long-term receivables",null,null,40555,73043,40555,40555,40555,0,40555,40555,40555]
["Inventory",2,370635,450155,395369,450155,450155,450155,-82276,450155,450155,450155]
["Total current assets",null,{"$f":"SUM(C6:C11)","v":43748068},76348630,144434319,76348630,74315630,74315630,11438686,75615630,75615630,75615630]
[]
["Non current assets"]
["Long-term receivables"]
["Investments",null,null,null,0]
["Investment property",null,53891030,73290026,72906699,52836248,52836248,52836248,-50000,52836248,52836248,52836248]
["Investment in Associate"]
["Property, plant and equipment",3,{"$f":"'SA3'!C26","v":1153361203},{"$f":"'SA3'!D26","v":702109801},{"$f":"'SA3'!E26","v":673610998},{"$f":"'SA3'!F26","v":1044128007},{"$f":"'SA3'!G26","v":1044128007},{"$f":"'SA3'!H26","v":1044127738},{"$f":"'SA3'!I26","v":0},{"$f":"'SA3'!J26","v":1044127738},{"$f":"'SA3'!K26","v":1044127738},{"$f":"'SA3'!L26","v":1044127738}]
["Agricultural"]
["Biological"]
["Intangible",null,-33202,1062836,697340,1826143,1826143,1826143,null,1826143,1826143,1826143]
["Other non-current assets",null,323705,364453,383389,328695,328695,328695,null,328695,328695,328695]
["Total non current assets",null,{"$f":"SUM(C15:C23)","v":1207542736},{"$f":"SUM(D15:D23)","v":776827116},{"$f":"SUM(E15:E23)","v":747598426},1099119093,1099119093,1099118824,-50000,1099118824,1099118824,1099118824]
["TOTAL ASSETS",null,{"$f":"C12+C24","v":1251290804},{"$f":"D12+D24","v":853175746},{"$f":"E12+E24","v":892032745},{"$f":"F12+F24","v":1175467723},1173434723,1173434454,11388686,1174734454,1174734454,1174734454]
[]
["LIABILITIES"]
["Current liabilities"]
["Bank overdraft",1,0,0,0,0,0,null,null,769786,769786,769786]
["Borrowing",4,{"$f":"'SA3'!C32","v":1132167},{"$f":"'SA3'!D32","v":809536},{"$f":"'SA3'!E32","v":263581},{"$f":"'SA3'!F32","v":809536},{"$f":"'SA3'!G32","v":809536},{"$f":"'SA3'!H32","v":809536},{"$f":"'SA3'!I32","v":0},{"$f":"'SA3'!J32","v":809536},{"$f":"'SA3'!K32","v":809536},{"$f":"'SA3'!L32","v":809536}]
["Consumer deposits",null,786920,819109,846036,769786,769786,769786]
["Trade and other payables",4,{"$f":"'SA3'!C38","v":216593494},{"$f":"'SA3'!D38","v":293585456},{"$f":"'SA3'!E38","v":375354982},{"$f":"'SA3'!F38","v":58768059},{"$f":"'SA3'!G38","v":58768059},{"$f":"'SA3'!H38","v":58768059},{"$f":"'SA3'!I38","v":-10640943},{"$f":"'SA3'!J38","v":58768059},{"$f":"'SA3'!K38","v":58768059},{"$f":"'SA3'!L38","v":58768059}]
["Provisions",null,null,null,null,null,null,null,-71139]
["Total current liabilities",null,{"$f":"SUM(C29:C33)","v":218512581},295214101,376464599,60347381,60347381,60347381,-10712082,60347381,60347381,60347381]
[]
["Non current liabilities"]
["Borrowing",null,{"$f":"'SA3'!C43","v":2190411},{"$f":"'SA3'!D43","v":1316665},{"$f":"'SA3'!E43","v":764702},{"$f":"'SA3'!F43","v":2506575},{"$f":"'SA3'!G43","v":2506575},{"$f":"'SA3'!H43","v":2506575},{"$f":"'SA3'!I43","v":152986},{"$f":"'SA3'!J43","v":2506575},{"$f":"'SA3'!K43","v":2506575},{"$f":"'SA3'!L43","v":2506575}]
["Provisions",null,{"$f":"'SA3'!C50","v":23645333},{"$f":"'SA3'!D50","v":24217687},{"$f":"'SA3'!E50","v":24132241},{"$f":"'SA3'!F50","v":13685857},{"$f":"'SA3'!G50","v":13685857},{"$f":"'SA3'!H50","v":13685857},{"$f":"'SA3'!I50","v":0},{"$f":"'SA3'!J50","v":13685857},{"$f":"'SA3'!K50","v":13685857},{"$f":"'SA3'!L50","v":13685857}]
["Total non current liabilities",null,{"$f":"SUM(C37:C38)","v":25835744},{"$f":"SUM(D37:D38)","v":25534352},{"$f":"SUM(E37:E38)","v":24896943},{"$f":"SUM(F37:F38)","v":16192432},16192432,16192432,152986,16192432,{"$f":"SUM(K37:K38)","v":16192432},16192432]
["TOTAL LIABILITIES",null,{"$f":"C34+C39","v":244348325},{"$f":"D34+D39","v":320748453},{"$f":"E34+E39","v":401361542},{"$f":"F34+F39","v":76539813},76539813,76539813,-10559096,76539813,{"$f":"K34+K39","v":76539813},76539813]
[]
["NET ASSETS",5,{"$f":"C25-C40","v":1006942479},532427293,490671203,1098927910,1096894910,1096894641,21947782,1098194641,1098194641,1098194641]
[]
["COMMUNITY WEALTH/EQUITY"]
["Accumulated Surplus/(Deficit)",null,1006942479,532426863,490671094,1098927641,null,null,21947782,1098194641,1098194641,1098194641]
["Reserves",4,{"$f":"'SA3'!C69","v":0},{"$f":"'SA3'!D69","v":0},{"$f":"'SA3'!E69","v":0},{"$f":"'SA3'!F69","v":0},{"$f":"'SA3'!G69","v":0},{"$f":"'SA3'!H69","v":0},{"$f":"'SA3'!I69","v":0},{"$f":"'SA3'!J69","v":0},{"$f":"'SA3'!K69","v":0},{"$f":"'SA3'!L69","v":0}]
[null,null,null,null,null,null,1096894641,1096894641]
["TOTAL COMMUNITY WEALTH/EQUITY",5,{"$f":"SUM(C45:C47)","v":1006942479},{"$f":"SUM(D45:D47)","v":532426863},490671094,1098927641,1096894641,1096894641,21947782,1098194641,1098194641,1098194641]
[{"$f":"head27a","v":"References"}]
["1. Detail to be provided in Table SA3"]
["2. Include completed low cost housing to be transferred to beneficiaries within 12 months"]
["3. Include 'Construction-work-in-progress' (disclosed separately in annual financial statements)"]
["4. Detail to be provided in Table SA3. Includes reserves to be funded by statute."]
["5. Net assets must balance with Total Community Wealth/Equity"]
["check balance",null,{"$f":"IF((C42-C48)=0,0,\"Unbalanced\")","v":0},{"$f":"IF((D42-D48)=0,0,\"Unbalanced\")","v":"Unbalanced"},"Unbalanced","Unbalanced","Unbalanced",0,0,0,0,0]
[]
[]
[]
[]
[]
[]
[]
[]
[]
[]
[]
[]
[]
[]
[]
["Test",null,{"$f":"IF(C25<>C40,\"Unbalanced\",0)","v":"Unbalanced"},{"$f":"IF(D25<>D40,\"Unbalanced\",0)","v":"Unbalanced"},"Unbalanced","Unbalanced","Unbalanced","Unbalanced","Unbalanced","Unbalanced","Unbalanced","Unbalanced"]

{"sheet":"A7-CFlow","index":15,"n_rows":51,"n_cols":12,"rows_kept":51,"cut":false,"hidden":false,"merged":[[1,9,1,11],[1,5,1,8]]}
[{"$f":"muni&\" - \"&Approve7","v":"FS205 Mafube - Table A7 Budgeted Cash Flows"}]
[{"$f":"desc","v":"Description"},{"$f":"head27","v":"Ref"},{"$f":"head1b","v":"2013/14"},{"$f":"head1A","v":"2014/15"},{"$f":"Head1","v":"2015/16"},{"$f":"Head2","v":"Current Year 2016/17"},null,null,null,{"$f":"Head3","v":"2017/18 Medium Term Revenue & Expenditure Framework"}]
["R thousand",null,{"$f":"Head5","v":"Audited Outcome"},{"$f":"Head5","v":"Audited Outcome"},{"$f":"Head5","v":"Audited Outcome"},{"$f":"Head6","v":"Original Budget"},{"$f":"Head7","v":"Adjusted Budget"},{"$f":"Head8","v":"Full Year Forecast"},{"$f":"Head5b","v":"Pre-audit outcome"},{"$f":"Head9","v":"Budget Year 2017/18"},{"$f":"Head10","v":"Budget Year +1 2018/19"},{"$f":"Head11","v":"Budget Year +2 2019/20"}]
["CASH FLOW FROM OPERATING ACTIVITIES"]
["Receipts"]
["Property rates, penalties & collection charges",null,null,21152561,22693193,27148891,27148891,27148891,7483690,{"$f":"'SA30'!N5+'SA30'!N6","v":28804972.990260001},{"$f":"'SA30'!O5+'SA30'!O6","v":30562076.3426659},{"$f":"'SA30'!P5+'SA30'!P6","v":32426362.9995685}]
["Service charges",null,21155325,6549242,65138739,24201783,53781740,53781740,6925425,{"$f":"'SA30'!N7+'SA30'!N8+'SA30'!N9+'SA30'!N10+'SA30'!N11","v":13525063.954285709},{"$f":"'SA30'!O7+'SA30'!O8+'SA30'!O9+'SA30'!O10+'SA30'!O11","v":14350092.855497139},{"$f":"'SA30'!P7+'SA30'!P8+'SA30'!P9+'SA30'!P10+'SA30'!P11","v":15225448.51968246}]
["Other revenue",null,10440477,14557142,3169799,3521420,2921566,2921566,25687264,{"$f":"'SA30'!N12+'SA30'!N16+'SA30'!N17+'SA30'!N18+'SA30'!N20","v":2916606.514148782},{"$f":"'SA30'!O12+'SA30'!O16+'SA30'!O17+'SA30'!O18+'SA30'!O20","v":3014945.0535119534},{"$f":"'SA30'!P12+'SA30'!P16+'SA30'!P17+'SA30'!P18+'SA30'!P20","v":3198857.1717761219}]
["Government - operating",1,76355000,62602468,96317704,81524000,87524000,87524000,67800000,{"$f":"'SA30'!N19","v":83172000},{"$f":"'SA30'!O19","v":90157000},{"$f":"'SA30'!P19","v":95121000}]
["Government - capital",1,28387000,27400000,3266880,32422000,32422000,32422000,5572000,{"$f":"'SA30'!N24","v":32080000},{"$f":"'SA30'!O24","v":30874000},{"$f":"'SA30'!P24","v":37037000}]
["Interest",null,12998767,19675097,26053407,26474501,26474501,26474501,null,{"$f":"'SA30'!N13+'SA30'!N14","v":27627121.243088},{"$f":"'SA30'!O13+'SA30'!O14","v":29284962.760636102},{"$f":"'SA30'!P13+'SA30'!P14","v":31042287.838057779}]
["Dividends",null,null,null,null,3342298,3342298,3342298,null,{"$f":"'SA30'!N15","v":3546177.8172599999},{"$f":"'SA30'!O15","v":3762494.6641128599},{"$f":"'SA30'!P15","v":3992006.8386237398}]
["Payments"]
["Suppliers and employees",null,-107635768,-113340403,-196972524,-177795560,-183318020,-183318020,-209055010,{"$f":"-('SA30'!N36+'SA30'!N37+'SA30'!N39+'SA30'!N40+'SA30'!N41+'SA30'!N42+'SA30'!N45+'SA30'!N51)","v":-151704403.918612},{"$f":"-('SA30'!O36+'SA30'!O37+'SA30'!O39+'SA30'!O40+'SA30'!O41+'SA30'!O42+'SA30'!O45+'SA30'!O51)","v":-159707485.22820807},{"$f":"-('SA30'!P36+'SA30'!P37+'SA30'!P39+'SA30'!P40+'SA30'!P41+'SA30'!P42+'SA30'!P45+'SA30'!P51)","v":-169449542.08439517}]
["Finance charges",null,-5853682,-10159131,-19479001,-3211126,-3211126,-3211126,null,{"$f":"-('SA30'!N38)","v":-3298072},{"$f":"-('SA30'!O38)","v":-3499254.392},{"$f":"-('SA30'!P38)","v":-3712708.9099119995}]
["Transfers and Grants",1,null,null,null,-5252545,-5252545,-5252545,-646308,{"$f":"-('SA30'!N43+'SA30'!N44)","v":-10000000},{"$f":"-('SA30'!O43+'SA30'!O44)","v":-10610000},{"$f":"-('SA30'!P43+'SA30'!P44)","v":-11257210}]
["NET CASH FROM/(USED) OPERATING ACTIVITIES",null,{"$f":"SUM(C6:C12)+SUM(C14:C16)","v":35847119},28436976,188197,12375662,41833305,41833305,-96232939,26669466.600430489,28188832.056215912,33623502.373401433]
[]
["CASH FLOWS FROM INVESTING ACTIVITIES"]
["Receipts"]
["Proceeds on disposal of PPE",null,null,-23338,-51424,null,null,null,null,{"$f":"'SA30'!N25+'SA30'!N26","v":0},{"$f":"'SA30'!O25+'SA30'!O26","v":0},{"$f":"'SA30'!P25+'SA30'!P26","v":0}]
["Decrease (Increase) in non-current debtors",null,null,null,null,null,null,null,null,{"$f":"'SA30'!N30","v":0},{"$f":"'SA30'!O30","v":0},{"$f":"'SA30'!P30","v":0}]
["Decrease (increase) other non-current receivables",null,null,null,null,null,null,null,null,{"$f":"'SA30'!N31","v":0},{"$f":"'SA30'!O31","v":0},{"$f":"'SA30'!P31","v":0}]
["Decrease (increase) in non-current investments",null,62547,null,null,null,null,null,96534307,{"$f":"'SA30'!N32","v":0},{"$f":"'SA30'!O32","v":0},{"$f":"'SA30'!P32","v":0}]
["Payments"]
["Capital assets",null,-29459050,-23320089,-35758,-41931635,-41931635,-41931635,null,{"$f":"-('SA30'!N49)","v":-33091912.757599995},{"$f":"-('SA30'!O49)","v":-31995991.885175999},{"$f":"-('SA30'!P49)","v":-38276269.364027761}]
["NET CASH FROM/(USED) INVESTING ACTIVITIES",null,{"$f":"SUM(C21:C24)+C26","v":-29396503},{"$f":"SUM(D21:D24)+D26","v":-23343427},-87182,-41931635,-41931635,-41931635,96534307,-33091912.757599995,-31995991.885175999,-38276269.364027761]
[]
["CASH FLOWS FROM FINANCING ACTIVITIES"]
["Receipts"]
["Short term loans",null,null,null,null,null,null,null,null,{"$f":"'SA30'!N27","v":0},{"$f":"'SA30'!O27","v":0},{"$f":"'SA30'!P27","v":0}]
["Borrowing long term/refinancing",null,null,null,null,null,null,null,null,{"$f":"'SA30'!N28","v":0},{"$f":"'SA30'!O28","v":0},{"$f":"'SA30'!P28","v":0}]
["Increase (decrease) in consumer deposits",null,null,null,null,null,null,null,null,{"$f":"'SA30'!N29","v":0},{"$f":"'SA30'!O29","v":0},{"$f":"'SA30'!P29","v":0}]
["Payments"]
["Repayment of borrowing",null,-5569111,-3145152,-529097,null,300000,300000,-150000,{"$f":"-('SA30'!N50)","v":0},{"$f":"-('SA30'!O50)","v":0},{"$f":"-('SA30'!P50)","v":0}]
["NET CASH FROM/(USED) FINANCING ACTIVITIES",null,{"$f":"SUM(C31:C33)+C35","v":-5569111},{"$f":"SUM(D31:D33)+D35","v":-3145152},-529097,0,300000,300000,-150000,0,0,0]
[]
["NET INCREASE/ (DECREASE) IN CASH HELD",null,{"$f":"C17+C27+C36","v":881505},{"$f":"D17+D27+D36","v":1948397},-428082,-29555973,201670,201670,151368,-6422446.157169506,-3807159.8289600872,-4652766.9906263277]
["Cash/cash equivalents at the year begin:",2,2699097,64367,619928,null,null,null,89077,{"$f":"'SA30'!N55","v":0},{"$f":"J40","v":-6422446.157169506},{"$f":"K40","v":-10229605.986129593}]
["Cash/cash equivalents at the year end:",2,{"$f":"C38+C39","v":3580602},{"$f":"D38+D39","v":2012764},{"$f":"E38+E39","v":191846},{"$f":"F38+F39","v":-29555973},201670,201670,240445,-6422446.157169506,-10229605.986129593,-14882372.976755921]
[{"$f":"head27a","v":"References"}]
["1. Local/District municipalities to include transfers from/to District/Local Municipalities"]
["2. Cash equivalents includes investments with maturities of 3 months or less"]
["3. The MTREF is populated directly from SA30."]
["Total receipts",null,{"$f":"SUM(C6:C12)+SUM(C21:C23)","v":149336569},151913172,216588298,198634893,233614996,233614996,113468379,191671942.51904249,202005571.67642397,218042963.36770859]
["Total payments",null,{"$f":"SUM(C14:C16)+C26","v":-142948500},{"$f":"SUM(D14:D16)+D26","v":-146819623},-216487283,-228190866,-233713326,-233713326,-209701318,-198094388.67621201,-205812731.50538406,-222695730.35833493]
[null,null,{"$f":"C45+C46","v":6388069},{"$f":"D45+D46","v":5093549},101015,-29555973,-98330,-98330,-96232939,-6422446.1571695209,-3807159.8289600909,-4652766.9906263351]
["Borrowings & investments & c.deposits",null,{"$f":"C24+C32+C33","v":62547},{"$f":"D24+D32+D33","v":0},0,0,0,0,96534307,0,0,0]
[{"$f":"A35","v":"Repayment of borrowing"},null,{"$f":"C35","v":-5569111},{"$f":"D35","v":-3145152},-529097,0,300000,300000,{"$f":"I35","v":-150000},0,0,0]
[null,null,{"$f":"C47+C48+C49","v":881505},{"$f":"D47+D48+D49","v":1948397},-428082,-29555973,201670,201670,151368,-6422446.1571695209,-3807159.8289600909,-4652766.9906263351]
[null,null,{"$f":"C38-C50","v":0},0,0,0,0,0,0,1.4901161193847656E-8,3.7252902984619141E-9,7.4505805969238281E-9]

{"sheet":"A8-ResRecon","index":16,"n_rows":67,"n_cols":12,"rows_kept":67,"cut":false,"hidden":false,"merged":[[1,9,1,11],[1,5,1,8]]}
[{"$f":"muni&\" - \"&Approve8","v":"FS205 Mafube - Table A8 Cash backed reserves/accumulated surplus reconciliation"}]
[{"$f":"desc","v":"Description"},{"$f":"head27","v":"Ref"},{"$f":"head1b","v":"2013/14"},{"$f":"head1A","v":"2014/15"},{"$f":"Head1","v":"2015/16"},{"$f":"Head2","v":"Current Year 2016/17"},null,null,null,{"$f":"Head3","v":"2017/18 Medium Term Revenue & Expenditure Framework"}]
["R thousand",null,{"$f":"Head5","v":"Audited Outcome"},{"$f":"Head5","v":"Audited Outcome"},{"$f":"Head5","v":"Audited Outcome"},{"$f":"Head6","v":"Original Budget"},{"$f":"Head7","v":"Adjusted Budget"},{"$f":"Head8","v":"Full Year Forecast"},{"$f":"Head5b","v":"Pre-audit outcome"},{"$f":"Head9","v":"Budget Year 2017/18"},{"$f":"Head10","v":"Budget Year +1 2018/19"},{"$f":"Head11","v":"Budget Year +2 2019/20"}]
["Cash and investments available"]
[{"$f":"LEFT('A7-CFlow'!A40,37)","v":"Cash/cash equivalents at the year end"},1,{"$f":"'A7-CFlow'!C40","v":3580602},{"$f":"'A7-CFlow'!D40","v":2012764},{"$f":"'A7-CFlow'!E40","v":191846},{"$f":"'A7-CFlow'!F40","v":-29555973},{"$f":"'A7-CFlow'!G40","v":201670},{"$f":"'A7-CFlow'!H40","v":201670},{"$f":"'A7-CFlow'!I40","v":240445},{"$f":"'A7-CFlow'!J40","v":-6422446.157169506},{"$f":"'A7-CFlow'!K40","v":-10229605.986129593},{"$f":"'A7-CFlow'!L40","v":-14882372.976755921}]
["Other current investments  > 90 days",null,{"$f":"'A6-FinPos'!C6+'A6-FinPos'!C7-'A6-FinPos'!C29-'A8-ResRecon'!C5","v":-3484820},{"$f":"'A6-FinPos'!D6+'A6-FinPos'!D7-'A6-FinPos'!D29-'A8-ResRecon'!D5","v":-1392836},{"$f":"'A6-FinPos'!E6+'A6-FinPos'!E7-'A6-FinPos'!E29-'A8-ResRecon'!E5","v":443498},{"$f":"'A6-FinPos'!F6+'A6-FinPos'!F7-'A6-FinPos'!F29-'A8-ResRecon'!F5","v":30175901},{"$f":"'A6-FinPos'!G6+'A6-FinPos'!G7-'A6-FinPos'!G29-'A8-ResRecon'!G5","v":418258},{"$f":"'A6-FinPos'!H6+'A6-FinPos'!H7-'A6-FinPos'!H29-'A8-ResRecon'!H5","v":418258},{"$f":"'A6-FinPos'!I6+'A6-FinPos'!I7-'A6-FinPos'!I29-'A8-ResRecon'!I5","v":4265599},{"$f":"'A6-FinPos'!J6+'A6-FinPos'!J7-'A6-FinPos'!J29-'A8-ResRecon'!J5","v":6272588.157169506},{"$f":"'A6-FinPos'!K6+'A6-FinPos'!K7-'A6-FinPos'!K29-'A8-ResRecon'!K5","v":10079747.986129593},{"$f":"'A6-FinPos'!L6+'A6-FinPos'!L7-'A6-FinPos'!L29-'A8-ResRecon'!L5","v":14732514.976755921}]
[{"$f":"'A6-FinPos'!A14&\" - \"&'A6-FinPos'!A16","v":"Non current assets - Investments"},1,{"$f":"'A6-FinPos'!C16","v":0},{"$f":"'A6-FinPos'!D16","v":0},{"$f":"'A6-FinPos'!E16","v":0},{"$f":"'A6-FinPos'!F16","v":0},{"$f":"'A6-FinPos'!G16","v":0},{"$f":"'A6-FinPos'!H16","v":0},{"$f":"'A6-FinPos'!I16","v":0},{"$f":"'A6-FinPos'!J16","v":0},{"$f":"'A6-FinPos'!K16","v":0},{"$f":"'A6-FinPos'!L16","v":0}]
["Cash and investments available:",null,{"$f":"SUM(C5:C7)","v":95782},{"$f":"SUM(D5:D7)","v":619928},635344,619928,619928,619928,4506044,-149858,-149858,-149858]
[]
["Application of cash and investments"]
[{"$f":"'SA3'!A36","v":"Unspent conditional transfers"},null,{"$f":"'SA3'!C36","v":0},{"$f":"'SA3'!D36","v":0},{"$f":"'SA3'!E36","v":0},{"$f":"'SA3'!F36","v":0},{"$f":"'SA3'!G36","v":0},{"$f":"'SA3'!H36","v":0},{"$f":"'SA3'!I36","v":0},{"$f":"'SA3'!J36","v":0},{"$f":"'SA3'!K36","v":0},{"$f":"'SA3'!L36","v":0}]
["Unspent borrowing",null,{"$f":"'SA17'!C67","v":0},{"$f":"'SA17'!D67","v":0},{"$f":"'SA17'!E67","v":0},{"$f":"'SA17'!F67","v":0},{"$f":"'SA17'!G67","v":0},{"$f":"'SA17'!H67","v":0},null,{"$f":"'SA17'!I67","v":0},{"$f":"'SA17'!J67","v":0},{"$f":"'SA17'!K67","v":0}]
["Statutory requirements",2]
["Other working capital requirements",3,{"$f":"-C32","v":199925494},{"$f":"-D32","v":263458456},264827982,{"$f":"-F32","v":21343059},2819059,3123059,-10640943,29756059,29779059,29773059]
["Other provisions"]
["Long term investments committed",4,{"$f":"C52","v":0},{"$f":"D52","v":0},0,0,0,0,0,0,0,0]
["Reserves to be backed by cash/investments",5]
[{"$f":"\"Total \"&A10&\":\"","v":"Total Application of cash and investments:"},null,{"$f":"SUM(C11:C17)","v":199925494},{"$f":"SUM(D11:D17)","v":263458456},264827982,21343059,2819059,3123059,-10640943,29756059,29779059,29773059]
["Surplus(shortfall)",null,{"$f":"C8-C18","v":-199829712},{"$f":"D8-D18","v":-262838528},-264192638,-20723131,-2199131,-2503131,15146987,-29905917,-29928917,-29922917]
[{"$f":"head27a","v":"References"}]
["1. Must reconcile with Budgeted Cash Flows"]
["2. For example: VAT, taxation"]
["3. Council approval for policy required - include sufficient working capital (e.g. allowing for a % of current debtors > 90 days as uncollectable)"]
["4. For example: sinking fund requirements for borrowing"]
["5. Council approval required for each reserve created and basis of cash backing of reserves"]
[]
[]
["Other working capital requirements"]
["Debtors",null,{"$f":"IF(ISERROR(ROUND(C35*C36,-3)),0,(ROUND(C35*C36,-3)))","v":16668000},{"$f":"IF(ISERROR(ROUND(D35*D36,-3)),0,(ROUND(D35*D36,-3)))","v":30127000},110527000,37425000,55949000,55645000,0,29012000,28989000,28995000]
[]
["Creditors due",null,{"$f":"'SA3'!C35","v":216593494},{"$f":"'SA3'!D35","v":293585456},{"$f":"'SA3'!E35","v":375354982},{"$f":"'SA3'!F35","v":58768059},{"$f":"'SA3'!G35","v":58768059},{"$f":"'SA3'!H35","v":58768059},{"$f":"'SA3'!I35","v":-10640943},{"$f":"'SA3'!J35","v":58768059},{"$f":"'SA3'!K35","v":58768059},{"$f":"'SA3'!L35","v":58768059}]
["Total",null,{"$f":"C29-C31","v":-199925494},{"$f":"D29-D31","v":-263458456},-264827982,-21343059,-2819059,-3123059,10640943,-29756059,-29779059,-29773059]
[]
["Debtors collection assumptions"]
["Balance outstanding - debtors",null,{"$f":"'A6-FinPos'!C8+'A6-FinPos'!C9+'A6-FinPos'!C15","v":43281651},{"$f":"'A6-FinPos'!D8+'A6-FinPos'!D9+'A6-FinPos'!D15","v":75237992},{"$f":"'A6-FinPos'!E8+'A6-FinPos'!E9+'A6-FinPos'!E15","v":143330563},{"$f":"'A6-FinPos'!F8+'A6-FinPos'!F9+'A6-FinPos'!F15","v":75237992},{"$f":"'A6-FinPos'!G8+'A6-FinPos'!G9+'A6-FinPos'!G15","v":73204992},{"$f":"'A6-FinPos'!H8+'A6-FinPos'!H9+'A6-FinPos'!H15","v":73204992},{"$f":"'A6-FinPos'!I8+'A6-FinPos'!I9+'A6-FinPos'!I15","v":7014918},{"$f":"'A6-FinPos'!J8+'A6-FinPos'!J9+'A6-FinPos'!J15","v":74504992},{"$f":"'A6-FinPos'!K8+'A6-FinPos'!K9+'A6-FinPos'!K15","v":74504992},{"$f":"'A6-FinPos'!L8+'A6-FinPos'!L9+'A6-FinPos'!L15","v":74504992}]
["Estimate of debtors collection rate",null,{"$f":"IF(ISERROR('SA10'!D10),0,('SA10'!D10))","v":0.38510195076153791},{"$f":"IF(ISERROR('SA10'!E10),0,('SA10'!E10))","v":0.4004236049297451},{"$f":"IF(ISERROR('SA10'!F10),0,('SA10'!F10))","v":0.77113607987177279},{"$f":"IF(ISERROR('SA10'!G10),0,('SA10'!G10))","v":0.49742000978793122},{"$f":"IF(ISERROR('SA10'!H10),0,('SA10'!H10))","v":0.76428398634212447},{"$f":"IF(ISERROR('SA10'!I10),0,('SA10'!I10))","v":0.76012700832010416},{"$f":"IF(ISERROR('SA10'!J10),0,('SA10'!J10))","v":0},{"$f":"IF(ISERROR('SA10'!K10),0,('SA10'!K10))","v":0.38939635772643527},{"$f":"IF(ISERROR('SA10'!L10),0,('SA10'!L10))","v":0.3890885609059509},{"$f":"IF(ISERROR('SA10'!M10),0,('SA10'!M10))","v":0.38917509263636824}]
[]
[]
[null,null,null,null,null,null,null,null,null,null,"`"]
[{"$f":"A16","v":"Long term investments committed"}]
["Balance (Insert description; eg sinking fund)"]
[]
[]
[]
[]
[]
[]
[]
[]
[]
[]
[null,null,{"$f":"SUM(C41:C51)","v":0},{"$f":"SUM(D41:D51)","v":0},0,0,0,0,0,0,0,0]
[{"$f":"A17","v":"Reserves to be backed by cash/investments"}]
[{"$f":"'SA3'!A64","v":"Housing Development Fund"},null,{"$f":"'SA3'!C64","v":0},{"$f":"'SA3'!D64","v":0},{"$f":"'SA3'!E64","v":0},{"$f":"'SA3'!F64","v":0},{"$f":"'SA3'!G64","v":0},{"$f":"'SA3'!H64","v":0},{"$f":"'SA3'!I64","v":0},{"$f":"'SA3'!J64","v":0},{"$f":"'SA3'!K64","v":0},{"$f":"'SA3'!L64","v":0}]
[{"$f":"'SA3'!A65","v":"Capital replacement"}]
[{"$f":"'SA3'!A66","v":"Self-insurance"}]
["Other (list)"]
[]
[]
[]
[]
[]
[]
[]
[]
[]
[null,null,{"$f":"SUM(C54:C65)","v":0},0,0,0,0,0,0,0,0,0]

{"sheet":"A9-Asset","index":17,"n_rows":95,"n_cols":11,"rows_kept":95,"cut":false,"hidden":false,"merged":[[1,5,1,7],[1,8,1,10]]}
[{"$f":"muni&\" - \"&Approve9","v":"FS205 Mafube - Table A9 Asset Management"}]
[{"$f":"desc","v":"Description"},{"$f":"head27","v":"Ref"},{"$f":"head1b","v":"2013/14"},{"$f":"head1A","v":"2014/15"},{"$f":"Head1","v":"2015/16"},{"$f":"Head2","v":"Current Year 2016/17"},null,null,{"$f":"Head3","v":"2017/18 Medium Term Revenue & Expenditure Framework"}]
["R thousand",null,{"$f":"Head5","v":"Audited Outcome"},{"$f":"Head5","v":"Audited Outcome"},{"$f":"Head5","v":"Audited Outcome"},{"$f":"Head6","v":"Original Budget"},{"$f":"Head7","v":"Adjusted Budget"},{"$f":"Head8","v":"Full Year Forecast"},{"$f":"Head9","v":"Budget Year 2017/18"},{"$f":"Head10","v":"Budget Year +1 2018/19"},{"$f":"Head11","v":"Budget Year +2 2019/20"}]
["CAPITAL EXPENDITURE"]
["Total New Assets",1,{"$f":"SUM(C11:C18)","v":25642024},{"$f":"SUM(D11:D18)","v":14082654},{"$f":"SUM(E11:E18)","v":9031915},39604726,39604726,39604726,25867842.037599999,30921661.885175999,37149604.364027761]
["  Infrastructure - Road transport",null,{"$f":"SA34a!C7","v":0},{"$f":"SA34a!D7","v":0},{"$f":"SA34a!E7","v":0},{"$f":"SA34a!F7","v":0},{"$f":"SA34a!G7","v":0},{"$f":"SA34a!H7","v":0},{"$f":"SA34a!I7","v":0},{"$f":"SA34a!J7","v":2958082.85},{"$f":"SA34a!K7","v":1456380}]
["  Infrastructure - Electricity",null,{"$f":"SA34a!C10","v":0},{"$f":"SA34a!D10","v":0},{"$f":"SA34a!E10","v":0},{"$f":"SA34a!F10","v":14000000},{"$f":"SA34a!G10","v":14000000},{"$f":"SA34a!H10","v":14000000},{"$f":"SA34a!I10","v":5000000},{"$f":"SA34a!J10","v":7000000},{"$f":"SA34a!K10","v":12000000}]
["  Infrastructure - Water",null,{"$f":"SA34a!C14","v":0},{"$f":"SA34a!D14","v":0},{"$f":"SA34a!E14","v":0},{"$f":"SA34a!F14","v":2251238},{"$f":"SA34a!G14","v":2251238},{"$f":"SA34a!H14","v":2251238},{"$f":"SA34a!I14","v":992331.67},{"$f":"SA34a!J14","v":10353897.859999999},{"$f":"SA34a!K14","v":18580105}]
["  Infrastructure - Sanitation",null,{"$f":"SA34a!C18","v":0},{"$f":"SA34a!D18","v":0},{"$f":"SA34a!E18","v":0},{"$f":"SA34a!F18","v":16772753},{"$f":"SA34a!G18","v":16772753},{"$f":"SA34a!H18","v":16772753},{"$f":"SA34a!I18","v":17509597.609999999},{"$f":"SA34a!J18","v":8293989.29},{"$f":"SA34a!K18","v":2622000}]
["  Infrastructure - Other",null,{"$f":"SA34a!C21","v":24010930},{"$f":"SA34a!D21","v":12656687},{"$f":"SA34a!E21","v":7829391},{"$f":"SA34a!F21","v":90735},{"$f":"SA34a!G21","v":90735},{"$f":"SA34a!H21","v":90735},{"$f":"SA34a!I21","v":365912.75760000001},{"$f":"SA34a!J21","v":193691.88517599995},{"$f":"SA34a!K21","v":239677.36402775999}]
["Infrastructure",null,{"$f":"SUM(C6:C10)","v":24010930},{"$f":"SUM(D6:D10)","v":12656687},{"$f":"SUM(E6:E10)","v":7829391},33114726,33114726,33114726,23867842.037599999,28799661.885175999,34898162.364027761]
[{"$f":"$A$42","v":"Community"},null,{"$f":"SA34a!C27","v":1528209},{"$f":"SA34a!D27","v":789220},{"$f":"SA34a!E27","v":222400},{"$f":"SA34a!F27","v":1500000},{"$f":"SA34a!G27","v":1500000},{"$f":"SA34a!H27","v":1500000},{"$f":"SA34a!I27","v":0},{"$f":"SA34a!J27","v":0},{"$f":"SA34a!K27","v":0}]
[{"$f":"$A$43","v":"Heritage assets"},null,{"$f":"SA34a!C43","v":0},{"$f":"SA34a!D43","v":0},{"$f":"SA34a!E43","v":0},{"$f":"SA34a!F43","v":0},{"$f":"SA34a!G43","v":0},{"$f":"SA34a!H43","v":0},{"$f":"SA34a!I43","v":0},{"$f":"SA34a!J43","v":0},{"$f":"SA34a!K43","v":0}]
[{"$f":"$A$44","v":"Investment properties"},null,{"$f":"SA34a!C47","v":0},{"$f":"SA34a!D47","v":0},{"$f":"SA34a!E47","v":0},{"$f":"SA34a!F47","v":0},{"$f":"SA34a!G47","v":0},{"$f":"SA34a!H47","v":0},{"$f":"SA34a!I47","v":0},{"$f":"SA34a!J47","v":0},{"$f":"SA34a!K47","v":0}]
[{"$f":"$A$45","v":"Other assets"},6,{"$f":"SA34a!C51","v":102885},{"$f":"SA34a!D51","v":636747},{"$f":"SA34a!E51","v":980124},{"$f":"SA34a!F51","v":3290000},{"$f":"SA34a!G51","v":3290000},{"$f":"SA34a!H51","v":3290000},{"$f":"SA34a!I51","v":0},{"$f":"SA34a!J51","v":0},{"$f":"SA34a!K51","v":0}]
["Agricultural Assets",null,{"$f":"SA34a!C65","v":0},{"$f":"SA34a!D65","v":0},{"$f":"SA34a!E65","v":0},{"$f":"SA34a!F65","v":0},{"$f":"SA34a!G65","v":0},{"$f":"SA34a!H65","v":0},{"$f":"SA34a!I65","v":0},{"$f":"SA34a!J65","v":0},{"$f":"SA34a!K65","v":0}]
[{"$f":"SA34a!A69","v":"Biological assets"},null,{"$f":"SA34a!C69","v":0},{"$f":"SA34a!D69","v":0},{"$f":"SA34a!E69","v":0},{"$f":"SA34a!F69","v":0},{"$f":"SA34a!G69","v":0},{"$f":"SA34a!H69","v":0},{"$f":"SA34a!I69","v":0},{"$f":"SA34a!J69","v":0},{"$f":"SA34a!K69","v":0}]
[{"$f":"SA34a!A73","v":"Intangibles"},null,{"$f":"SA34a!C73","v":0},{"$f":"SA34a!D73","v":0},{"$f":"SA34a!E73","v":0},{"$f":"SA34a!F73","v":1700000},{"$f":"SA34a!G73","v":1700000},{"$f":"SA34a!H73","v":1700000},{"$f":"SA34a!I73","v":2000000},{"$f":"SA34a!J73","v":2122000},{"$f":"SA34a!K73","v":2251442}]
[]
["Total Renewal of Existing Assets",2,{"$f":"SUM(C26:C33)","v":0},{"$f":"SUM(D26:D33)","v":0},{"$f":"SUM(E26:E33)","v":0},2326909,2326909,2326909,7224070.7199999997,1074330,1126665]
["  Infrastructure - Road transport",null,{"$f":"SA34b!C7","v":0},{"$f":"SA34b!D7","v":0},{"$f":"SA34b!E7","v":0},{"$f":"SA34b!F7","v":0},{"$f":"SA34b!G7","v":0},{"$f":"SA34b!H7","v":0},{"$f":"SA34b!I7","v":0},{"$f":"SA34b!J7","v":0},{"$f":"SA34b!K7","v":0}]
["  Infrastructure - Electricity",null,{"$f":"SA34b!C10","v":0},{"$f":"SA34b!D10","v":0},{"$f":"SA34b!E10","v":0},{"$f":"SA34b!F10","v":0},{"$f":"SA34b!G10","v":0},{"$f":"SA34b!H10","v":0},{"$f":"SA34b!I10","v":0},{"$f":"SA34b!J10","v":0},{"$f":"SA34b!K10","v":0}]
["  Infrastructure - Water",null,{"$f":"SA34b!C14","v":0},{"$f":"SA34b!D14","v":0},{"$f":"SA34b!E14","v":0},{"$f":"SA34b!F14","v":0},{"$f":"SA34b!G14","v":0},{"$f":"SA34b!H14","v":0},{"$f":"SA34b!I14","v":0},{"$f":"SA34b!J14","v":0},{"$f":"SA34b!K14","v":0}]
["  Infrastructure - Sanitation",null,{"$f":"SA34b!C18","v":0},{"$f":"SA34b!D18","v":0},{"$f":"SA34b!E18","v":0},{"$f":"SA34b!F18","v":0},{"$f":"SA34b!G18","v":0},{"$f":"SA34b!H18","v":0},{"$f":"SA34b!I18","v":0},{"$f":"SA34b!J18","v":0},{"$f":"SA34b!K18","v":0}]
["  Infrastructure - Other",null,{"$f":"SA34b!C21","v":0},{"$f":"SA34b!D21","v":0},{"$f":"SA34b!E21","v":0},{"$f":"SA34b!F21","v":0},{"$f":"SA34b!G21","v":0},{"$f":"SA34b!H21","v":0},{"$f":"SA34b!I21","v":0},{"$f":"SA34b!J21","v":0},{"$f":"SA34b!K21","v":0}]
[{"$f":"$A$11","v":"Infrastructure"},null,{"$f":"SUM(C21:C25)","v":0},{"$f":"SUM(D21:D25)","v":0},{"$f":"SUM(E21:E25)","v":0},0,0,0,0,0,0]
[{"$f":"A12","v":"Community"},null,{"$f":"SA34b!C27","v":0},{"$f":"SA34b!D27","v":0},{"$f":"SA34b!E27","v":0},{"$f":"SA34b!F27","v":2326909},{"$f":"SA34b!G27","v":2326909},{"$f":"SA34b!H27","v":2326909},{"$f":"SA34b!I27","v":7224070.7199999997},{"$f":"SA34b!J27","v":1074330},{"$f":"SA34b!K27","v":1126665}]
[{"$f":"A13","v":"Heritage assets"},null,{"$f":"SA34b!C43","v":0},{"$f":"SA34b!D43","v":0},{"$f":"SA34b!E43","v":0},{"$f":"SA34b!F43","v":0},{"$f":"SA34b!G43","v":0},{"$f":"SA34b!H43","v":0},{"$f":"SA34b!I43","v":0},{"$f":"SA34b!J43","v":0},{"$f":"SA34b!K43","v":0}]
[{"$f":"A14","v":"Investment properties"},null,{"$f":"SA34b!C47","v":0},{"$f":"SA34b!D47","v":0},{"$f":"SA34b!E47","v":0},{"$f":"SA34b!F47","v":0},{"$f":"SA34b!G47","v":0},{"$f":"SA34b!H47","v":0},{"$f":"SA34b!I47","v":0},{"$f":"SA34b!J47","v":0},{"$f":"SA34b!K47","v":0}]
[{"$f":"A15","v":"Other assets"},6,{"$f":"SA34b!C51","v":0},{"$f":"SA34b!D51","v":0},{"$f":"SA34b!E51","v":0},{"$f":"SA34b!F51","v":0},{"$f":"SA34b!G51","v":0},{"$f":"SA34b!H51","v":0},{"$f":"SA34b!I51","v":0},{"$f":"SA34b!J51","v":0},{"$f":"SA34b!K51","v":0}]
["Agricultural Assets",null,{"$f":"SA34b!C65","v":0},{"$f":"SA34b!D65","v":0},{"$f":"SA34b!E65","v":0},{"$f":"SA34b!F65","v":0},{"$f":"SA34b!G65","v":0},{"$f":"SA34b!H65","v":0},{"$f":"SA34b!I65","v":0},{"$f":"SA34b!J65","v":0},{"$f":"SA34b!K65","v":0}]
[{"$f":"A17","v":"Biological assets"},null,{"$f":"SA34b!C69","v":0},{"$f":"SA34b!D69","v":0},{"$f":"SA34b!E69","v":0},{"$f":"SA34b!F69","v":0},{"$f":"SA34b!G69","v":0},{"$f":"SA34b!H69","v":0},{"$f":"SA34b!I69","v":0},{"$f":"SA34b!J69","v":0},{"$f":"SA34b!K69","v":0}]
[{"$f":"A18","v":"Intangibles"},null,{"$f":"SA34b!C73","v":0},{"$f":"SA34b!D73","v":0},{"$f":"SA34b!E73","v":0},{"$f":"SA34b!F73","v":0},{"$f":"SA34b!G73","v":0},{"$f":"SA34b!H73","v":0},{"$f":"SA34b!I73","v":0},{"$f":"SA34b!J73","v":0},{"$f":"SA34b!K73","v":0}]
[]
["Total Capital Expenditure",4]
["  Infrastructure - Road transport",null,{"$f":"C6+C21","v":0},{"$f":"D6+D21","v":0},0,0,0,0,0,2958082.85,1456380]
["  Infrastructure - Electricity",null,{"$f":"C7+C22","v":0},{"$f":"D7+D22","v":0},0,14000000,14000000,14000000,5000000,7000000,12000000]
["  Infrastructure - Water",null,{"$f":"C8+C23","v":0},0,0,2251238,2251238,2251238,992331.67,10353897.859999999,18580105]
["  Infrastructure - Sanitation",null,{"$f":"C9+C24","v":0},{"$f":"D9+D24","v":0},{"$f":"E9+E24","v":0},16772753,16772753,16772753,17509597.609999999,8293989.29,2622000]
["  Infrastructure - Other",null,{"$f":"C10+C25","v":24010930},12656687,7829391,90735,90735,90735,365912.75760000001,193691.88517599995,239677.36402775999]
[{"$f":"$A$11","v":"Infrastructure"},null,{"$f":"SUM(C36:C40)","v":24010930},{"$f":"SUM(D36:D40)","v":12656687},7829391,33114726,33114726,33114726,23867842.037599999,28799661.885175999,34898162.364027761]
[{"$f":"SA34a!A27","v":"Community"},null,{"$f":"C12+C27","v":1528209},{"$f":"D12+D27","v":789220},222400,3826909,3826909,3826909,7224070.7199999997,1074330,1126665]
[{"$f":"SA34a!A43","v":"Heritage assets"},null,0,{"$f":"D13+D28","v":0},0,0,0,0,0,0,0]
[{"$f":"SA34a!A47","v":"Investment properties"},null,0,{"$f":"D14+D29","v":0},0,0,0,0,0,0,0]
[{"$f":"SA34a!A51","v":"Other assets"},null,102885,{"$f":"D15+D30","v":636747},980124,3290000,3290000,3290000,0,0,0]
["Agricultural Assets",null,0,{"$f":"D16+D31","v":0},0,0,0,0,0,0,0]
[{"$f":"A32","v":"Biological assets"},null,0,{"$f":"D17+D32","v":0},0,0,0,0,0,0,0]
[{"$f":"A33","v":"Intangibles"},null,0,{"$f":"D18+D33","v":0},0,1700000,1700000,1700000,2000000,2122000,2251442]
["TOTAL CAPITAL EXPENDITURE - Asset class",2,{"$f":"SUM(C41:C48)","v":25642024},14082654,9031915,41931635,41931635,41931635,33091912.757599998,31995991.885175999,38276269.364027761]
[]
["ASSET REGISTER SUMMARY - PPE (WDV)",5]
["  Infrastructure - Road transport"]
["  Infrastructure - Electricity"]
["  Infrastructure - Water"]
["  Infrastructure - Sanitation"]
["  Infrastructure - Other",null,790092000,12657000,7829000,696020000,696019817,null,696019817,696019817,696019817]
[{"$f":"A41","v":"Infrastructure"},null,{"$f":"SUM(C52:C56)","v":790092000},{"$f":"SUM(D52:D56)","v":12657000},7829000,696020000,696019817,0,696019817,696019817,696019817]
[{"$f":"A12","v":"Community"},null,1558000,789000,222000,5979037,5979037,null,5979037,5979037,5979037]
[{"$f":"A13","v":"Heritage assets"}]
[{"$f":"A14","v":"Investment properties"},null,{"$f":"'A6-FinPos'!C17","v":53891030},{"$f":"'A6-FinPos'!D17","v":73290026},{"$f":"'A6-FinPos'!E17","v":72906699},{"$f":"'A6-FinPos'!F17","v":52836248},{"$f":"'A6-FinPos'!G17","v":52836248},{"$f":"'A6-FinPos'!H17","v":52836248},{"$f":"'A6-FinPos'!J17","v":52836248},{"$f":"'A6-FinPos'!K17","v":52836248},{"$f":"'A6-FinPos'!L17","v":52836248}]
[{"$f":"A15","v":"Other assets"},null,356731000,637000,980000,395293827,395293827,0,395293827,395293827,395293827]
["Agricultural Assets",null,{"$f":"'A6-FinPos'!C20","v":0},{"$f":"'A6-FinPos'!D20","v":0},{"$f":"'A6-FinPos'!E20","v":0},{"$f":"'A6-FinPos'!F20","v":0},{"$f":"'A6-FinPos'!G20","v":0},{"$f":"'A6-FinPos'!H20","v":0},{"$f":"'A6-FinPos'!J20","v":0},{"$f":"'A6-FinPos'!K20","v":0},{"$f":"'A6-FinPos'!L20","v":0}]
[{"$f":"A17","v":"Biological assets"},null,{"$f":"'A6-FinPos'!C21","v":0},{"$f":"'A6-FinPos'!D21","v":0},{"$f":"'A6-FinPos'!E21","v":0},{"$f":"'A6-FinPos'!F21","v":0},{"$f":"'A6-FinPos'!G21","v":0},{"$f":"'A6-FinPos'!H21","v":0},{"$f":"'A6-FinPos'!J21","v":0},{"$f":"'A6-FinPos'!K21","v":0},{"$f":"'A6-FinPos'!L21","v":0}]
[{"$f":"A18","v":"Intangibles"},null,{"$f":"'A6-FinPos'!C22","v":-33202},{"$f":"'A6-FinPos'!D22","v":1062836},{"$f":"'A6-FinPos'!E22","v":697340},{"$f":"'A6-FinPos'!F22","v":1826143},{"$f":"'A6-FinPos'!G22","v":1826143},{"$f":"'A6-FinPos'!H22","v":1826143},{"$f":"'A6-FinPos'!J22","v":1826143},{"$f":"'A6-FinPos'!K22","v":1826143},{"$f":"'A6-FinPos'!L22","v":1826143}]
["TOTAL ASSET REGISTER SUMMARY - PPE (WDV)",5,{"$f":"SUM(C57:C64)","v":1202238828},88435862,82635039,1151955255,1151955072,54662391,1151955072,1151955072,1151955072]
[]
["EXPENDITURE OTHER ITEMS"]
[{"$f":"'A4-FinPerf RE'!A28","v":"Depreciation & asset impairment"},null,{"$f":"'A4-FinPerf RE'!C28","v":137283347},{"$f":"'A4-FinPerf RE'!D28","v":37286363},{"$f":"'A4-FinPerf RE'!E28","v":38259177},{"$f":"'A4-FinPerf RE'!F28","v":1500000},{"$f":"'A4-FinPerf RE'!G28","v":1500000},{"$f":"'A4-FinPerf RE'!H28","v":1500000},{"$f":"'A4-FinPerf RE'!J28","v":38259177},{"$f":"'A4-FinPerf RE'!K28","v":38259177},{"$f":"'A4-FinPerf RE'!L28","v":38259177}]
["Repairs and Maintenance by Asset Class",3,{"$f":"SUM(C75:C79)","v":11206908},{"$f":"SUM(D75:D79)","v":32876183},0,13885000,13885000,13885000,18240509.91,20718382.460000001,23950789.119999997]
["  Infrastructure - Road transport",null,{"$f":"SA34c!C7","v":0},{"$f":"SA34c!D7","v":0},{"$f":"SA34c!E7","v":0},{"$f":"SA34c!F7","v":0},{"$f":"SA34c!G7","v":0},{"$f":"SA34c!H7","v":0},{"$f":"SA34c!I7","v":500000},{"$f":"SA34c!J7","v":530500},{"$f":"SA34c!K7","v":562860.5}]
["  Infrastructure - Electricity",null,{"$f":"SA34c!C10","v":0},{"$f":"SA34c!D10","v":0},{"$f":"SA34c!E10","v":0},{"$f":"SA34c!F10","v":0},{"$f":"SA34c!G10","v":0},{"$f":"SA34c!H10","v":0},{"$f":"SA34c!I10","v":0},{"$f":"SA34c!J10","v":0},{"$f":"SA34c!K10","v":0}]
["  Infrastructure - Water",null,{"$f":"SA34c!C14","v":0},{"$f":"SA34c!D14","v":0},{"$f":"SA34c!E14","v":0},{"$f":"SA34c!F14","v":0},{"$f":"SA34c!G14","v":0},{"$f":"SA34c!H14","v":0},{"$f":"SA34c!I14","v":1425255},{"$f":"SA34c!J14","v":1512195},{"$f":"SA34c!K14","v":1604439}]
["  Infrastructure - Sanitation",null,{"$f":"SA34c!C18","v":0},{"$f":"SA34c!D18","v":0},{"$f":"SA34c!E18","v":0},{"$f":"SA34c!F18","v":0},{"$f":"SA34c!G18","v":0},{"$f":"SA34c!H18","v":0},{"$f":"SA34c!I18","v":5000000},{"$f":"SA34c!J18","v":7484000},{"$f":"SA34c!K18","v":9484000}]
["  Infrastructure - Other",null,{"$f":"SA34c!C21","v":0},{"$f":"SA34c!D21","v":32876183},{"$f":"SA34c!E21","v":0},{"$f":"SA34c!F21","v":0},{"$f":"SA34c!G21","v":0},{"$f":"SA34c!H21","v":0},{"$f":"SA34c!I21","v":0},{"$f":"SA34c!J21","v":0},{"$f":"SA34c!K21","v":0}]
[{"$f":"$A$11","v":"Infrastructure"},null,{"$f":"SUM(C70:C74)","v":0},{"$f":"SUM(D70:D74)","v":32876183},0,0,0,0,6925255,9526695,11651299.5]
[{"$f":"A12","v":"Community"},null,{"$f":"SA34c!C27","v":11206908},{"$f":"SA34c!D27","v":0},{"$f":"SA34c!E27","v":0},{"$f":"SA34c!F27","v":570000},{"$f":"SA34c!G27","v":570000},{"$f":"SA34c!H27","v":570000},{"$f":"SA34c!I27","v":200000},{"$f":"SA34c!J27","v":212200},{"$f":"SA34c!K27","v":225144.19999999998}]
[{"$f":"A13","v":"Heritage assets"},null,{"$f":"SA34c!C43","v":0},{"$f":"SA34c!D43","v":0},{"$f":"SA34c!E43","v":0},{"$f":"SA34c!F43","v":0},{"$f":"SA34c!G43","v":0},{"$f":"SA34c!H43","v":0},{"$f":"SA34c!I43","v":0},{"$f":"SA34c!J43","v":0},{"$f":"SA34c!K43","v":0}]
[{"$f":"A14","v":"Investment properties"},null,{"$f":"SA34c!C47","v":0},{"$f":"SA34c!D47","v":0},{"$f":"SA34c!E47","v":0},{"$f":"SA34c!F47","v":0},{"$f":"SA34c!G47","v":0},{"$f":"SA34c!H47","v":0},{"$f":"SA34c!I47","v":0},{"$f":"SA34c!J47","v":0},{"$f":"SA34c!K47","v":0}]
[{"$f":"A15","v":"Other assets"},"6, 7",{"$f":"SA34c!C51+SA34c!C65+SA34c!C69+SA34c!C73","v":0},{"$f":"SA34c!D51+SA34c!D65+SA34c!D69+SA34c!D73","v":0},{"$f":"SA34c!E51+SA34c!E65+SA34c!E69+SA34c!E73","v":0},{"$f":"SA34c!F51+SA34c!F65+SA34c!F69+SA34c!F73","v":13315000},{"$f":"SA34c!G51+SA34c!G65+SA34c!G69+SA34c!G73","v":13315000},{"$f":"SA34c!H51+SA34c!H65+SA34c!H69+SA34c!H73","v":13315000},{"$f":"SA34c!I51+SA34c!I65+SA34c!I69+SA34c!I73","v":11115254.91},{"$f":"SA34c!J51+SA34c!J65+SA34c!J69+SA34c!J73","v":10979487.460000001},{"$f":"SA34c!K51+SA34c!K65+SA34c!K69+SA34c!K73","v":12074345.42}]
["TOTAL EXPENDITURE OTHER ITEMS",null,{"$f":"SUM(C68:C69)","v":148490255},70162546,38259177,15385000,15385000,15385000,56499686.909999996,58977559.460000001,62209966.119999997]
[]
["Renewal of Existing Assets as % of total capex",null,{"$f":"IF(ISERROR(C20/C49),0,(C20/C49))","v":0},{"$f":"IF(ISERROR(D20/D49),0,(D20/D49))","v":0},0,5.5492923183176619E-2,5.5492923183176619E-2,5.5492923183176619E-2,0.21830320818614196,3.3577018142005019E-2,2.9435078671978563E-2]
["Renewal of Existing Assets as % of deprecn\"",null,{"$f":"IF(ISERROR(C20/C68),0,(C20/C68))","v":0},{"$f":"IF(ISERROR(D20/D68),0,(D20/D68))","v":0},0,1.5512726666666667,1.5512726666666667,1.5512726666666667,0.18881929216616447,2.8080321748687902E-2,2.9448228852387494E-2]
["R&M as a % of PPE",null,{"$f":"IF(ISERROR(ROUND(C69/'A6-FinPos'!C19,3)),0,(ROUND(C69/'A6-FinPos'!C19,3)))","v":0.01},{"$f":"IF(ISERROR(ROUND(D69/'A6-FinPos'!D19,3)),0,(ROUND(D69/'A6-FinPos'!D19,3)))","v":4.7E-2},{"$f":"IF(ISERROR(ROUND(E69/'A6-FinPos'!E19,3)),0,(ROUND(E69/'A6-FinPos'!E19,3)))","v":0},{"$f":"IF(ISERROR(ROUND(F69/'A6-FinPos'!F19,3)),0,(ROUND(F69/'A6-FinPos'!F19,3)))","v":1.2999999999999999E-2},{"$f":"IF(ISERROR(ROUND(G69/'A6-FinPos'!G19,3)),0,(ROUND(G69/'A6-FinPos'!G19,3)))","v":1.2999999999999999E-2},{"$f":"IF(ISERROR(ROUND(H69/'A6-FinPos'!H19,3)),0,(ROUND(H69/'A6-FinPos'!H19,3)))","v":1.2999999999999999E-2},{"$f":"IF(ISERROR(ROUND(I69/'A6-FinPos'!J19,3)),0,(ROUND(I69/'A6-FinPos'!J19,3)))","v":1.7000000000000001E-2},{"$f":"IF(ISERROR(ROUND(J69/'A6-FinPos'!K19,3)),0,(ROUND(J69/'A6-FinPos'!K19,3)))","v":0.02},{"$f":"IF(ISERROR(ROUND(K69/'A6-FinPos'!L19,3)),0,(ROUND(K69/'A6-FinPos'!L19,3)))","v":2.3E-2}]
["Renewal and R&M as a % of PPE",null,{"$f":"IF(ISERROR(ROUND((C20+C69)/C65,2)),0,(ROUND((C20+C69)/C65,2)))","v":0.01},{"$f":"IF(ISERROR(ROUND((D20+D69)/D65,2)),0,(ROUND((D20+D69)/D65,2)))","v":0.37},0,0.01,0.01,0.3,0.02,0.02,0.02]
[]
[{"$f":"head27a","v":"References"}]
["1. Detail of new assets provided in Table SA34a"]
["2. Detail of renewal of existing assets provided in Table SA34b"]
["3. Detail of Repairs and Maintenance by Asset Class provided in Table SA34c"]
["4. Must reconcile to total capital expenditure on Budgeted Capital Expenditure"]
["5. Must reconcile to 'Budgeted Financial Position' (written down value)"]
["6. Donated/contributed and assets funded by finance leases to be allocated to the respective category"]
["7. Including repairs and maintenance to agricultural, biological and intangible assets"]
["Check balance to A6",null,{"$f":"C65-'A6-FinPos'!C17-'A6-FinPos'!C19-'A6-FinPos'!C21-'A6-FinPos'!C22","v":-4980203},{"$f":"D65-'A6-FinPos'!D17-'A6-FinPos'!D19-'A6-FinPos'!D21-'A6-FinPos'!D22","v":-688026801},{"$f":"E65-'A6-FinPos'!E17-'A6-FinPos'!E19-'A6-FinPos'!E21-'A6-FinPos'!E22","v":-664579998},{"$f":"F65-'A6-FinPos'!F17-'A6-FinPos'!F19-'A6-FinPos'!F21-'A6-FinPos'!F22","v":53164857},{"$f":"G65-'A6-FinPos'!G17-'A6-FinPos'!G19-'A6-FinPos'!G21-'A6-FinPos'!G22","v":53164674},{"$f":"H65-'A6-FinPos'!H17-'A6-FinPos'!H19-'A6-FinPos'!H21-'A6-FinPos'!H22","v":-1044127738},{"$f":"I65-'A6-FinPos'!J17-'A6-FinPos'!J19-'A6-FinPos'!J21-'A6-FinPos'!J22","v":53164943},{"$f":"J65-'A6-FinPos'!K17-'A6-FinPos'!K19-'A6-FinPos'!K21-'A6-FinPos'!K22","v":53164943},{"$f":"K65-'A6-FinPos'!L17-'A6-FinPos'!L19-'A6-FinPos'!L21-'A6-FinPos'!L22","v":53164943}]

{"sheet":"A10-SerDel","index":18,"n_rows":89,"n_cols":11,"rows_kept":89,"cut":false,"hidden":false,"merged":[[1,5,1,7],[1,8,1,10],[1,0,2,0],[1,1,2,1]]}
[{"$f":"muni&\" - \"&Approve10","v":"FS205 Mafube - Table A10 Basic service delivery measurement"}]
[{"$f":"desc","v":"Description"},{"$f":"head27","v":"Ref"},{"$f":"head1b","v":"2013/14"},{"$f":"head1A","v":"2014/15"},{"$f":"Head1","v":"2015/16"},{"$f":"Head2","v":"Current Year 2016/17"},null,null,{"$f":"Head3","v":"2017/18 Medium Term Revenue & Expenditure Framework"}]
[null,null,{"$f":"Head5A","v":"Outcome"},{"$f":"Head5A","v":"Outcome"},{"$f":"Head5A","v":"Outcome"},{"$f":"Head6","v":"Original Budget"},{"$f":"Head7","v":"Adjusted Budget"},{"$f":"Head8","v":"Full Year Forecast"},{"$f":"Head9","v":"Budget Year 2017/18"},{"$f":"Head10","v":"Budget Year +1 2018/19"},{"$f":"Head11","v":"Budget Year +2 2019/20"}]
["Household service targets",1]
["Water:"]
["Piped water inside dwelling",null,{"$f":"'SA9'!E67","v":0},{"$f":"'SA9'!F67","v":0},{"$f":"'SA9'!G67","v":14000},{"$f":"'SA9'!H67","v":15000},{"$f":"'SA9'!I67","v":14000},{"$f":"'SA9'!J67","v":14000},{"$f":"'SA9'!K67","v":15000},{"$f":"'SA9'!L67","v":15000},{"$f":"'SA9'!M67","v":15000}]
["Piped water inside yard (but not in dwelling)",null,{"$f":"'SA9'!E68","v":0},{"$f":"'SA9'!F68","v":0},{"$f":"'SA9'!G68","v":0},{"$f":"'SA9'!H68","v":0},{"$f":"'SA9'!I68","v":0},{"$f":"'SA9'!J68","v":0},{"$f":"'SA9'!K68","v":0},{"$f":"'SA9'!L68","v":0},{"$f":"'SA9'!M68","v":0}]
["Using public tap (at least min.service level)",2,{"$f":"'SA9'!E69","v":0},{"$f":"'SA9'!F69","v":0},{"$f":"'SA9'!G69","v":0},{"$f":"'SA9'!H69","v":0},{"$f":"'SA9'!I69","v":0},{"$f":"'SA9'!J69","v":0},{"$f":"'SA9'!K69","v":0},{"$f":"'SA9'!L69","v":0},{"$f":"'SA9'!M69","v":0}]
["Other water supply (at least min.service level)",4,{"$f":"'SA9'!E70","v":0},{"$f":"'SA9'!F70","v":0},{"$f":"'SA9'!G70","v":0},{"$f":"'SA9'!H70","v":0},{"$f":"'SA9'!I70","v":0},{"$f":"'SA9'!J70","v":0},{"$f":"'SA9'!K70","v":0},{"$f":"'SA9'!L70","v":0},{"$f":"'SA9'!M70","v":0}]
["Minimum Service Level and Above sub-total",null,{"$f":"SUM(C6:C9)","v":0},{"$f":"SUM(D6:D9)","v":0},14000,15000,14000,14000,15000,15000,15000]
["Using public tap (< min.service level)",3,{"$f":"'SA9'!E72","v":0},{"$f":"'SA9'!F72","v":0},{"$f":"'SA9'!G72","v":1300},{"$f":"'SA9'!H72","v":600},{"$f":"'SA9'!I72","v":1300},{"$f":"'SA9'!J72","v":1300},{"$f":"'SA9'!K72","v":600},{"$f":"'SA9'!L72","v":600},{"$f":"'SA9'!M72","v":600}]
["Other water supply (< min.service level)",{"$f":"B9","v":4},{"$f":"'SA9'!E73","v":0},{"$f":"'SA9'!F73","v":0},{"$f":"'SA9'!G73","v":0},{"$f":"'SA9'!H73","v":0},{"$f":"'SA9'!I73","v":0},{"$f":"'SA9'!J73","v":0},{"$f":"'SA9'!K73","v":0},{"$f":"'SA9'!L73","v":0},{"$f":"'SA9'!M73","v":0}]
["No water supply",null,{"$f":"'SA9'!E74","v":0},{"$f":"'SA9'!F74","v":0},{"$f":"'SA9'!G74","v":0},{"$f":"'SA9'!H74","v":0},{"$f":"'SA9'!I74","v":0},{"$f":"'SA9'!J74","v":0},{"$f":"'SA9'!K74","v":0},{"$f":"'SA9'!L74","v":0},{"$f":"'SA9'!M74","v":0}]
["Below Minimum Service Level sub-total",null,{"$f":"SUM(C11:C13)","v":0},{"$f":"SUM(D11:D13)","v":0},1300,600,1300,1300,600,600,600]
["Total number of households",5,{"$f":"C10+C14","v":0},{"$f":"D10+D14","v":0},15300,15600,15300,15300,15600,15600,15600]
["Sanitation/sewerage:"]
["Flush toilet (connected to sewerage)",null,{"$f":"'SA9'!E78","v":0},{"$f":"'SA9'!F78","v":0},{"$f":"'SA9'!G78","v":14000},{"$f":"'SA9'!H78","v":15000},{"$f":"'SA9'!I78","v":14000},{"$f":"'SA9'!J78","v":14000},{"$f":"'SA9'!K78","v":15000},{"$f":"'SA9'!L78","v":15000},{"$f":"'SA9'!M78","v":15000}]
["Flush toilet (with septic tank)",null,{"$f":"'SA9'!E79","v":0},{"$f":"'SA9'!F79","v":0},{"$f":"'SA9'!G79","v":0},{"$f":"'SA9'!H79","v":0},{"$f":"'SA9'!I79","v":0},{"$f":"'SA9'!J79","v":0},{"$f":"'SA9'!K79","v":0},{"$f":"'SA9'!L79","v":0},{"$f":"'SA9'!M79","v":0}]
["Chemical toilet",null,{"$f":"'SA9'!E80","v":0},{"$f":"'SA9'!F80","v":0},{"$f":"'SA9'!G80","v":0},{"$f":"'SA9'!H80","v":0},{"$f":"'SA9'!I80","v":0},{"$f":"'SA9'!J80","v":0},{"$f":"'SA9'!K80","v":0},{"$f":"'SA9'!L80","v":0},{"$f":"'SA9'!M80","v":0}]
["Pit toilet (ventilated)",null,{"$f":"'SA9'!E81","v":0},{"$f":"'SA9'!F81","v":0},{"$f":"'SA9'!G81","v":0},{"$f":"'SA9'!H81","v":0},{"$f":"'SA9'!I81","v":0},{"$f":"'SA9'!J81","v":0},{"$f":"'SA9'!K81","v":0},{"$f":"'SA9'!L81","v":0},{"$f":"'SA9'!M81","v":0}]
["Other toilet provisions (> min.service level)",null,{"$f":"'SA9'!E82","v":0},{"$f":"'SA9'!F82","v":0},{"$f":"'SA9'!G82","v":0},{"$f":"'SA9'!H82","v":0},{"$f":"'SA9'!I82","v":0},{"$f":"'SA9'!J82","v":0},{"$f":"'SA9'!K82","v":0},{"$f":"'SA9'!L82","v":0},{"$f":"'SA9'!M82","v":0}]
[{"$f":"$A$10","v":"Minimum Service Level and Above sub-total"},null,{"$f":"SUM(C17:C21)","v":0},{"$f":"SUM(D17:D21)","v":0},14000,15000,14000,14000,15000,15000,15000]
["Bucket toilet",null,{"$f":"'SA9'!E84","v":0},{"$f":"'SA9'!F84","v":0},{"$f":"'SA9'!G84","v":0},{"$f":"'SA9'!H84","v":0},{"$f":"'SA9'!I84","v":0},{"$f":"'SA9'!J84","v":0},{"$f":"'SA9'!K84","v":0},{"$f":"'SA9'!L84","v":0},{"$f":"'SA9'!M84","v":0}]
["Other toilet provisions (< min.service level)",null,{"$f":"'SA9'!E85","v":0},{"$f":"'SA9'!F85","v":0},{"$f":"'SA9'!G85","v":0},{"$f":"'SA9'!H85","v":0},{"$f":"'SA9'!I85","v":0},{"$f":"'SA9'!J85","v":0},{"$f":"'SA9'!K85","v":0},{"$f":"'SA9'!L85","v":0},{"$f":"'SA9'!M85","v":0}]
["No toilet provisions",null,{"$f":"'SA9'!E86","v":0},{"$f":"'SA9'!F86","v":0},{"$f":"'SA9'!G86","v":0},{"$f":"'SA9'!H86","v":0},{"$f":"'SA9'!I86","v":0},{"$f":"'SA9'!J86","v":0},{"$f":"'SA9'!K86","v":0},{"$f":"'SA9'!L86","v":0},{"$f":"'SA9'!M86","v":0}]
[{"$f":"$A$14","v":"Below Minimum Service Level sub-total"},null,{"$f":"SUM(C23:C25)","v":0},{"$f":"SUM(D23:D25)","v":0},0,0,0,0,0,0,0]
[{"$f":"$A$15","v":"Total number of households"},{"$f":"$B$15","v":5},{"$f":"C22+C26","v":0},{"$f":"D22+D26","v":0},14000,15000,14000,14000,15000,15000,15000]
["Energy:"]
["Electricity (at least min.service level)",null,{"$f":"'SA9'!E90","v":0},{"$f":"'SA9'!F90","v":0},{"$f":"'SA9'!G90","v":0},{"$f":"'SA9'!H90","v":15500},{"$f":"'SA9'!I90","v":15000},{"$f":"'SA9'!J90","v":15000},{"$f":"'SA9'!K90","v":16000},{"$f":"'SA9'!L90","v":16000},{"$f":"'SA9'!M90","v":16000}]
["Electricity - prepaid (min.service level)",null,{"$f":"'SA9'!E91","v":0},{"$f":"'SA9'!F91","v":0},{"$f":"'SA9'!G91","v":0},{"$f":"'SA9'!H91","v":0},{"$f":"'SA9'!I91","v":0},{"$f":"'SA9'!J91","v":0},{"$f":"'SA9'!K91","v":0},{"$f":"'SA9'!L91","v":0},{"$f":"'SA9'!M91","v":0}]
[{"$f":"$A$10","v":"Minimum Service Level and Above sub-total"},null,{"$f":"SUM(C29:C30)","v":0},{"$f":"SUM(D29:D30)","v":0},0,15500,15000,15000,16000,16000,16000]
["Electricity (< min.service level)",null,{"$f":"'SA9'!E93","v":0},{"$f":"'SA9'!F93","v":0},{"$f":"'SA9'!G93","v":1430},{"$f":"'SA9'!H93","v":0},{"$f":"'SA9'!I93","v":0},{"$f":"'SA9'!J93","v":0},{"$f":"'SA9'!K93","v":0},{"$f":"'SA9'!L93","v":0},{"$f":"'SA9'!M93","v":0}]
["Electricity - prepaid (< min. service level)",null,{"$f":"'SA9'!E94","v":0},{"$f":"'SA9'!F94","v":0},{"$f":"'SA9'!G94","v":0},{"$f":"'SA9'!H94","v":0},{"$f":"'SA9'!I94","v":0},{"$f":"'SA9'!J94","v":0},{"$f":"'SA9'!K94","v":0},{"$f":"'SA9'!L94","v":0},{"$f":"'SA9'!M94","v":0}]
["Other energy sources",null,{"$f":"'SA9'!E95","v":0},{"$f":"'SA9'!F95","v":0},{"$f":"'SA9'!G95","v":1430},{"$f":"'SA9'!H95","v":1430},{"$f":"'SA9'!I95","v":1430},{"$f":"'SA9'!J95","v":1430},{"$f":"'SA9'!K95","v":2000},{"$f":"'SA9'!L95","v":2000},{"$f":"'SA9'!M95","v":2000}]
[{"$f":"$A$14","v":"Below Minimum Service Level sub-total"},null,{"$f":"SUM(C32:C34)","v":0},{"$f":"SUM(D32:D34)","v":0},2860,1430,1430,1430,2000,2000,2000]
[{"$f":"$A$15","v":"Total number of households"},{"$f":"$B$15","v":5},{"$f":"C31+C35","v":0},{"$f":"D31+D35","v":0},2860,16930,16430,16430,18000,18000,18000]
["Refuse:"]
["Removed at least once a week",null,{"$f":"'SA9'!E99","v":0},{"$f":"'SA9'!F99","v":0},{"$f":"'SA9'!G99","v":13500},{"$f":"'SA9'!H99","v":13500},{"$f":"'SA9'!I99","v":13500},{"$f":"'SA9'!J99","v":13500},{"$f":"'SA9'!K99","v":15500},{"$f":"'SA9'!L99","v":15500},{"$f":"'SA9'!M99","v":16000}]
[{"$f":"$A$10","v":"Minimum Service Level and Above sub-total"},null,{"$f":"SUM(C38)","v":0},{"$f":"SUM(D38)","v":0},13500,13500,13500,13500,15500,15500,16000]
["Removed less frequently than once a week",null,{"$f":"'SA9'!E101","v":0},{"$f":"'SA9'!F101","v":0},{"$f":"'SA9'!G101","v":0},{"$f":"'SA9'!H101","v":0},{"$f":"'SA9'!I101","v":0},{"$f":"'SA9'!J101","v":0},{"$f":"'SA9'!K101","v":0},{"$f":"'SA9'!L101","v":0},{"$f":"'SA9'!M101","v":0}]
["Using communal refuse dump",null,{"$f":"'SA9'!E102","v":0},{"$f":"'SA9'!F102","v":0},{"$f":"'SA9'!G102","v":0},{"$f":"'SA9'!H102","v":2000},{"$f":"'SA9'!I102","v":0},{"$f":"'SA9'!J102","v":0},{"$f":"'SA9'!K102","v":0},{"$f":"'SA9'!L102","v":0},{"$f":"'SA9'!M102","v":0}]
["Using own refuse dump",null,{"$f":"'SA9'!E103","v":0},{"$f":"'SA9'!F103","v":0},{"$f":"'SA9'!G103","v":4000},{"$f":"'SA9'!H103","v":4000},{"$f":"'SA9'!I103","v":4000},{"$f":"'SA9'!J103","v":4000},{"$f":"'SA9'!K103","v":4500},{"$f":"'SA9'!L103","v":4500},{"$f":"'SA9'!M103","v":5000}]
["Other rubbish disposal",null,{"$f":"'SA9'!E104","v":0},{"$f":"'SA9'!F104","v":0},{"$f":"'SA9'!G104","v":0},{"$f":"'SA9'!H104","v":0},{"$f":"'SA9'!I104","v":0},{"$f":"'SA9'!J104","v":0},{"$f":"'SA9'!K104","v":0},{"$f":"'SA9'!L104","v":0},{"$f":"'SA9'!M104","v":0}]
["No rubbish disposal",null,{"$f":"'SA9'!E105","v":0},{"$f":"'SA9'!F105","v":0},{"$f":"'SA9'!G105","v":0},{"$f":"'SA9'!H105","v":0},{"$f":"'SA9'!I105","v":0},{"$f":"'SA9'!J105","v":0},{"$f":"'SA9'!K105","v":0},{"$f":"'SA9'!L105","v":0},{"$f":"'SA9'!M105","v":0}]
[{"$f":"$A$14","v":"Below Minimum Service Level sub-total"},null,{"$f":"SUM(C40:C44)","v":0},0,4000,6000,4000,4000,4500,4500,5000]
[{"$f":"$A$15","v":"Total number of households"},{"$f":"$B$15","v":5},{"$f":"C39+C45","v":0},{"$f":"D39+D45","v":0},17500,19500,17500,17500,20000,20000,21000]
[]
["Households receiving Free Basic Service",7]
["Water (6 kilolitres per household per month)",null,{"$f":"'SA9'!E263","v":0},{"$f":"'SA9'!F263","v":0},{"$f":"'SA9'!G263","v":0},{"$f":"'SA9'!H263","v":0},{"$f":"'SA9'!I263","v":0},{"$f":"'SA9'!J263","v":0},{"$f":"'SA9'!K263","v":0},{"$f":"'SA9'!L263","v":0},{"$f":"'SA9'!M263","v":0}]
["Sanitation (free minimum level service)",null,{"$f":"'SA9'!E275","v":0},{"$f":"'SA9'!F275","v":0},{"$f":"'SA9'!G275","v":0},{"$f":"'SA9'!H275","v":0},{"$f":"'SA9'!I275","v":0},{"$f":"'SA9'!J275","v":0},{"$f":"'SA9'!K275","v":0},{"$f":"'SA9'!L275","v":0},{"$f":"'SA9'!M275","v":0}]
["Electricity/other energy (50kwh per household per month)",null,{"$f":"'SA9'!E251","v":0},{"$f":"'SA9'!F251","v":0},{"$f":"'SA9'!G251","v":0},{"$f":"'SA9'!H251","v":0},{"$f":"'SA9'!I251","v":0},{"$f":"'SA9'!J251","v":0},{"$f":"'SA9'!K251","v":0},{"$f":"'SA9'!L251","v":0},{"$f":"'SA9'!M251","v":0}]
["Refuse (removed at least once a week)",null,{"$f":"'SA9'!E287","v":0},{"$f":"'SA9'!F287","v":0},{"$f":"'SA9'!G287","v":0},{"$f":"'SA9'!H287","v":0},{"$f":"'SA9'!I287","v":0},{"$f":"'SA9'!J287","v":0},{"$f":"'SA9'!K287","v":0},{"$f":"'SA9'!L287","v":0},{"$f":"'SA9'!M287","v":0}]
[]
["Cost of Free Basic Services provided - Formal Settlements (R'000)",8]
["Water (6 kilolitres per indigent household per month)",null,{"$f":"'SA1'!C20","v":0},{"$f":"'SA1'!D20","v":0},{"$f":"'SA1'!E20","v":0},{"$f":"'SA1'!F20","v":0},{"$f":"'SA1'!G20","v":0},{"$f":"'SA1'!H20","v":0},{"$f":"'SA1'!J20","v":0},{"$f":"'SA1'!K20","v":0},{"$f":"'SA1'!L20","v":0}]
["Sanitation (free sanitation service to indigent households)",null,{"$f":"'SA1'!C26","v":0},{"$f":"'SA1'!D26","v":0},{"$f":"'SA1'!E26","v":0},{"$f":"'SA1'!F26","v":0},{"$f":"'SA1'!G26","v":0},{"$f":"'SA1'!H26","v":0},{"$f":"'SA1'!J26","v":0},{"$f":"'SA1'!K26","v":0},{"$f":"'SA1'!L26","v":0}]
["Electricity/other energy (50kwh per indigent household per month)",null,{"$f":"'SA1'!C14","v":0},{"$f":"'SA1'!D14","v":0},{"$f":"'SA1'!E14","v":0},{"$f":"'SA1'!F14","v":0},{"$f":"'SA1'!G14","v":0},{"$f":"'SA1'!H14","v":0},{"$f":"'SA1'!J14","v":0},{"$f":"'SA1'!K14","v":0},{"$f":"'SA1'!L14","v":0}]
["Refuse (removed once a week for indigent households)",null,{"$f":"'SA1'!C33","v":0},{"$f":"'SA1'!D33","v":0},{"$f":"'SA1'!E33","v":0},{"$f":"'SA1'!F33","v":0},{"$f":"'SA1'!G33","v":0},{"$f":"'SA1'!H33","v":0},{"$f":"'SA1'!J33","v":0},{"$f":"'SA1'!K33","v":0},{"$f":"'SA1'!L33","v":0}]
["Cost of Free Basic Services provided - Informal Formal Settlements (R'000)",null,{"$f":"'SA9'!E260+'SA9'!E272+'SA9'!E284+'SA9'!E296","v":0},{"$f":"'SA9'!F260+'SA9'!F272+'SA9'!F284+'SA9'!F296","v":0},{"$f":"'SA9'!G260+'SA9'!G272+'SA9'!G284+'SA9'!G296","v":0},{"$f":"'SA9'!H260+'SA9'!H272+'SA9'!H284+'SA9'!H296","v":17200},{"$f":"'SA9'!I260+'SA9'!I272+'SA9'!I284+'SA9'!I296","v":17200},{"$f":"'SA9'!J260+'SA9'!J272+'SA9'!J284+'SA9'!J296","v":17200},{"$f":"'SA9'!K260+'SA9'!K272+'SA9'!K284+'SA9'!K296","v":19200},{"$f":"'SA9'!L260+'SA9'!L272+'SA9'!L284+'SA9'!L296","v":19600},{"$f":"'SA9'!M260+'SA9'!M272+'SA9'!M284+'SA9'!M296","v":19600}]
["Total cost of FBS provided  ",null,{"$f":"SUM(C55:C59)","v":0},0,0,17200,17200,17200,19200,19600,19600]
[]
["Highest level of free service provided per household"]
["Property rates (R value threshold)",null,13000000]
["Water (kilolitres per household per month)"]
["Sanitation (kilolitres per household per month)"]
["Sanitation (Rand per household per month)"]
["Electricity (kwh per household per month)"]
["Refuse (average litres per week)"]
["Revenue  cost of subsidised services provided (R'000)",9]
["Property rates (tariff adjustment) ( impermissable values per section 17 of MPRA)"]
["Property rates  exemptions, reductions and rebates and impermissable values in excess of section 17 of MPRA)",null,{"$f":"'SA1'!C8","v":0},{"$f":"'SA1'!D8","v":0},{"$f":"'SA1'!E8","v":0},{"$f":"'SA1'!F8","v":0},{"$f":"'SA1'!G8","v":0},{"$f":"'SA1'!H8","v":0},{"$f":"'SA1'!J8","v":0},{"$f":"'SA1'!K8","v":0},{"$f":"'SA1'!L8","v":0}]
["Water (in excess of 6 kilolitres per indigent household per month)",null,{"$f":"'SA1'!C19","v":0},{"$f":"'SA1'!D19","v":0},{"$f":"'SA1'!E19","v":0},{"$f":"'SA1'!F19","v":0},{"$f":"'SA1'!G19","v":0},{"$f":"'SA1'!H19","v":0},{"$f":"'SA1'!J19","v":0},{"$f":"'SA1'!K19","v":0},{"$f":"'SA1'!L19","v":0}]
["Sanitation (in excess of free sanitation service to indigent households)",null,{"$f":"'SA1'!C25","v":0},{"$f":"'SA1'!D25","v":0},{"$f":"'SA1'!E25","v":0},{"$f":"'SA1'!F25","v":0},{"$f":"'SA1'!G25","v":0},{"$f":"'SA1'!H25","v":0},{"$f":"'SA1'!J25","v":0},{"$f":"'SA1'!K25","v":0},{"$f":"'SA1'!L25","v":0}]
["Electricity/other energy (in excess of 50 kwh per indigent household per month)",null,{"$f":"'SA1'!C13","v":0},{"$f":"'SA1'!D13","v":0},{"$f":"'SA1'!E13","v":0},{"$f":"'SA1'!F13","v":0},{"$f":"'SA1'!G13","v":0},{"$f":"'SA1'!H13","v":0},{"$f":"'SA1'!J13","v":0},{"$f":"'SA1'!K13","v":0},{"$f":"'SA1'!L13","v":0}]
["Refuse (in excess of one removal a week for indigent households)",null,{"$f":"'SA1'!C32","v":0},{"$f":"'SA1'!D32","v":0},{"$f":"'SA1'!E32","v":0},{"$f":"'SA1'!F32","v":0},{"$f":"'SA1'!G32","v":0},{"$f":"'SA1'!H32","v":0},{"$f":"'SA1'!J32","v":0},{"$f":"'SA1'!K32","v":0},{"$f":"'SA1'!L32","v":0}]
["Municipal Housing - rental rebates"]
["Housing - top structure subsidies",6]
["Other"]
["Total revenue cost of subsidised services provided ",null,{"$f":"SUM(C70:C78)","v":0},{"$f":"SUM(D70:D78)","v":0},0,0,0,0,0,{"$f":"SUM(J70:J78)","v":0},{"$f":"SUM(K70:K78)","v":0}]
[{"$f":"head27a","v":"References"}]
["1. Include services provided by another entity; e.g. Eskom"]
["2. Stand distance <= 200m from dwelling"]
["3. Stand distance > 200m from dwelling"]
["4. Borehole, spring, rain-water tank etc."]
["5. Must agree to total number of households in municipal area (informal settlements receiving services must be included)"]
["6. Include value of subsidy provided by municipality above provincial subsidy level"]
["7. Show number of households receiving at least these levels of services completely free (informal settlements must be included)"]
["8. Must reflect the cost to the municipality of providing the Free Basic Service"]
["9. Reflect the cost to the municipality in terms of 'revenue foregone' of providing free services (note this will not equal 'Revenue Foregone' on SA1)"]

{"sheet":"SA1","index":19,"n_rows":179,"n_cols":12,"rows_kept":179,"cut":false,"hidden":false,"merged":[[1,9,1,11],[1,5,1,8],[1,0,2,0],[1,1,2,1]]}
[{"$f":"muni&\" - \"&TableA1","v":"FS205 Mafube - Supporting Table SA1 Supportinging detail to 'Budgeted Financial Performance'"}]
[{"$f":"desc","v":"Description"},{"$f":"head27","v":"Ref"},{"$f":"head1b","v":"2013/14"},{"$f":"head1A","v":"2014/15"},{"$f":"Head1","v":"2015/16"},{"$f":"Head2","v":"Current Year 2016/17"},null,null,null,{"$f":"Head3","v":"2017/18 Medium Term Revenue & Expenditure Framework"}]
[null,null,{"$f":"Head5","v":"Audited Outcome"},{"$f":"Head5","v":"Audited Outcome"},{"$f":"Head5","v":"Audited Outcome"},{"$f":"Head6","v":"Original Budget"},{"$f":"Head7","v":"Adjusted Budget"},{"$f":"Head8","v":"Full Year Forecast"},{"$f":"Head5b","v":"Pre-audit outcome"},{"$f":"Head9","v":"Budget Year 2017/18"},{"$f":"Head10","v":"Budget Year +1 2018/19"},{"$f":"Head11","v":"Budget Year +2 2019/20"}]
["R thousand"]
["REVENUE ITEMS:"]
[{"$f":"'A4-FinPerf RE'!A5","v":"Property rates"},6]
["Total Property Rates",null,19474278,21152561,22693193,27148891,27148891,27148891,null,28804972.990260001,30562076.3426659,32426362.9995685]
["less Revenue Foregone (exemptions, reductions and rebates and impermissable values in excess of section 17 of MPRA)"]
["Net Property Rates",null,{"$f":"C7-C8","v":19474278},{"$f":"D7-D8","v":21152561},22693193,27148891,27148891,27148891,0,28804972.990260001,30562076.3426659,32426362.9995685]
[]
[{"$f":"'A4-FinPerf RE'!A7","v":"Service charges - electricity revenue"},6]
[{"$f":"\"Total \"&A11","v":"Total Service charges - electricity revenue"},null,-102286,-414,-1376]
["less Revenue Foregone (in excess of 50 kwh per indigent household per month)"]
["less Cost of Free Basis Services (50 kwh per indigent household per month)",null,{"$f":"'SA9'!E250","v":0},{"$f":"'SA9'!F250","v":0},{"$f":"'SA9'!G250","v":0},{"$f":"'SA9'!H250","v":0},{"$f":"'SA9'!I250","v":0},{"$f":"'SA9'!J250","v":0},null,{"$f":"'SA9'!K250","v":0},{"$f":"'SA9'!L250","v":0},{"$f":"'SA9'!M250","v":0}]
[{"$f":"\"Net \"& A11","v":"Net Service charges - electricity revenue"},null,{"$f":"C12-C13-C14","v":-102286},{"$f":"D12-D13-D14","v":-414},-1376,0,0,0,0,0,0,0]
[]
[{"$f":"'A4-FinPerf RE'!A8","v":"Service charges - water revenue"},6]
[{"$f":"\"Total \"&A17","v":"Total Service charges - water revenue"},null,18518134,31294060,33858861,23098760,23098760,23098760,null,24507784.338780001,26002759.183445599,27588927.4936358]
["less Revenue Foregone (in excess of 6 kilolitres per indigent household per month)"]
["less Cost of Free Basis Services (6 kilolitres per indigent household per month)",null,{"$f":"'SA9'!E262","v":0},{"$f":"'SA9'!F262","v":0},{"$f":"'SA9'!G262","v":0},{"$f":"'SA9'!H262","v":0},{"$f":"'SA9'!I262","v":0},{"$f":"'SA9'!J262","v":0},null,{"$f":"'SA9'!K262","v":0},{"$f":"'SA9'!L262","v":0},{"$f":"'SA9'!M262","v":0}]
[{"$f":"\"Net \"& A17","v":"Net Service charges - water revenue"},null,{"$f":"C18-C19-C20","v":18518134},{"$f":"D18-D19-D20","v":31294060},33858861,23098760,23098760,23098760,0,24507784.338780001,26002759.183445599,27588927.4936358]
[]
[{"$f":"'A4-FinPerf RE'!A9","v":"Service charges - sanitation revenue"}]
[{"$f":"\"Total \"&A23","v":"Total Service charges - sanitation revenue"},null,15312749,16696403,17305717,17776153,17776153,17776153,null,18860498.714960001,20010989.136572599,21231659.4739035]
["less Revenue Foregone (in excess of free sanitation service to indigent households)"]
["less Cost of Free Basis Services (free sanitation service to indigent households)",null,{"$f":"'SA9'!E274","v":0},{"$f":"'SA9'!F274","v":0},{"$f":"'SA9'!G274","v":0},{"$f":"'SA9'!H274","v":0},{"$f":"'SA9'!I274","v":0},{"$f":"'SA9'!J274","v":0},null,{"$f":"'SA9'!K274","v":0},{"$f":"'SA9'!L274","v":0},{"$f":"'SA9'!M274","v":0}]
[{"$f":"\"Net \"& A23","v":"Net Service charges - sanitation revenue"},null,{"$f":"C24-C25-C26","v":15312749},{"$f":"D24-D25-D26","v":16696403},17305717,17776153,17776153,17776153,0,18860498.714960001,20010989.136572599,21231659.4739035]
[]
[{"$f":"'A4-FinPerf RE'!A10","v":"Service charges - refuse revenue"},6]
["Total refuse removal revenue",null,13862071,12125447,12583451,12906827,12906827,12906827,null,13694143.57432,14529486.332353501,15415784.9986271]
["Total landfill revenue"]
["less Revenue Foregone (in excess of one removal a week to indigent households)"]
["less Cost of Free Basis Services  (removed once a week to indigent households)",null,{"$f":"'SA9'!E286","v":0},{"$f":"'SA9'!F286","v":0},{"$f":"'SA9'!G286","v":0},{"$f":"'SA9'!H286","v":0},{"$f":"'SA9'!I286","v":0},{"$f":"'SA9'!J286","v":0},null,{"$f":"'SA9'!K286","v":0},{"$f":"'SA9'!L286","v":0},{"$f":"'SA9'!M286","v":0}]
[{"$f":"\"Net \"& A29","v":"Net Service charges - refuse revenue"},null,{"$f":"SUM(C30:C31)-C32-C33","v":13862071},{"$f":"SUM(D30:D31)-D32-D33","v":12125447},12583451,12906827,12906827,12906827,0,13694143.57432,14529486.332353501,15415784.9986271]
[]
["Other Revenue by source"]
["Intrest earned outstading debtors"]
["Operatin g grants and subsidies"]
["Other Income",null,null,null,null,null,null,null,null,2532388.8577379999,2686864.5780600202,2850763.31732168]
["Rent facilities and equipment"]
["Interest earned - external investments"]
["Dividends received",null,null,null,null,null,null,null,null,null,0,0]
["Fines"]
["cemetary fees"]
["clearance certificate"]
["Transfers recognised - operational"]
["Other own revenue",null,212565,2782506,4148411,2480126,2480126,2480126]
["Gains on disposal of PPE",3,0,0,null,0,0,0]
["Total 'Other' Revenue",1,{"$f":"SUM(C37:C48)","v":212565},{"$f":"SUM(D37:D48)","v":2782506},4148411,2480126,2480126,2480126,0,2532388.8577379999,2686864.5780600202,2850763.31732168]
[]
["EXPENDITURE ITEMS:"]
[{"$f":"'A4-FinPerf RE'!A25","v":"Employee related costs"}]
["Basic Salaries and Wages",2,67173281,67116701,76439724,54506684,54921000,54506684,null,53523965.164381586,54059206.336025402,54599798.789385654]
["Pension and UIF Contributions",null,null,null,null,11955488.829650741,11955488.829650741,11955488.829650741,null,11631056.192902159,11747366.75483118,11864840.422379494]
["Medical Aid Contributions",null,null,null,null,5006747.0982830981,5006747.0982830981,5006747.0982830981,null,4870663.1664179349,4919369.7980821142,4968563.4960629353]
["Overtime",null,null,null,null,1729275.7920000001,1729275.7920000001,1729275.7920000001,null,1681346,1698159.46,1715141.0545999999]
["Performance Bonus",null,null,null,null,0,0,0,null,0,0,0]
["Motor Vehicle Allowance",null,1437442,null,null,5522451.8036101209,5522451.8036101209,5522451.8036101209,null,5403582.8088943185,5457618.6369832605,5512194.8233530931]
["Cellphone Allowance",null,null,null,null,105235.34651997121,105235.34651997121,105235.34651997121,null,102748.2849664,103775.76781606401,104813.52549422464]
["Housing Allowances",null,null,null,null,42741.411337655998,42741.411337655998,42741.411337655998,null,41556,41971.56,42391.275600000001]
["Other benefits and allowances",null,9352048,6194612,662509,8661256.0999999996,9443000,8661256.0999999996,null,8535682.9000000004,8621039.7290000003,8707250.126290001]
["Payments in lieu of leave",null,null,null,null,null,0]
["Long service awards",null,null,null,null,null,0]
["Post-retirement benefit obligations",4,null,null,null,null,0]
["sub-total",5,{"$f":"SUM(C53:C64)","v":77962771},{"$f":"SUM(D53:D64)","v":73311313},77102233,87529880.381401584,88725940.28140159,87529880.381401584,0,85790600.517562404,86648508.04273802,87514993.513165414]
["Less: Employees costs capitalised to PPE"]
[{"$f":"\"Total \"&A52","v":"Total Employee related costs"},1,{"$f":"C65-C66","v":77962771},{"$f":"D65-D66","v":73311313},77102233,87529880.381401584,88725940.28140159,87529880.381401584,0,85790600.517562404,86648508.04273802,87514993.513165414]
[]
["Contributions recognised - capital"]
["List contributions by contract"]
[]
[]
[]
[]
[]
[{"$f":"\"Total \"&A69","v":"Total Contributions recognised - capital"},null,{"$f":"SUM(C70:C75)","v":0},0,0,0,0,0,0,0,0,0]
[]
[{"$f":"'A4-FinPerf RE'!A28","v":"Depreciation & asset impairment"}]
["Depreciation of Property, Plant & Equipment",null,137283347,37286363,38259177,1500000,1500000,1500000,null,38259177,38259177,38259177]
["Lease amortisation"]
["Capital asset impairment"]
["Depreciation resulting from revaluation of PPE",10]
[{"$f":"\"Total \"&LEFT(A78,35)","v":"Total Depreciation & asset impairment"},1,{"$f":"SUM(C79:C81)-C82","v":137283347},{"$f":"SUM(D79:D81)-D82","v":37286363},38259177,1500000,1500000,1500000,0,{"$f":"SUM(J79:J81)-J82","v":38259177},38259177,38259177]
[]
[{"$f":"'A4-FinPerf RE'!A30","v":"Bulk purchases"}]
["Electricity Bulk Purchases",null,17199992,6729008,10962325,4000000,4000000,4000000,null,4000000,6000000,8000000]
["Water Bulk Purchases",null,10514964,17039629,34983969,2000000,2000000,2000000,null,2000000,2122000,3416420]
["Total bulk purchases",1,{"$f":"SUM(C86:C87)","v":27714956},{"$f":"SUM(D86:D87)","v":23768637},45946294,6000000,6000000,6000000,0,6000000,8122000,11416420]
[]
["Transfers and grants"]
["Cash transfers and grants",null,{"$f":"'SA21'!C32","v":0},{"$f":"'SA21'!D32","v":0},{"$f":"'SA21'!E32","v":0},{"$f":"'SA21'!F32","v":0},{"$f":"'SA21'!G32","v":0},{"$f":"'SA21'!H32","v":0},{"$f":"'SA21'!I32","v":0},{"$f":"'SA21'!J32","v":0},{"$f":"'SA21'!K32","v":0},{"$f":"'SA21'!L32","v":0}]
["Non-cash transfers and grants",null,{"$f":"'SA21'!C63","v":6746501},{"$f":"'SA21'!D63","v":3547907},{"$f":"'SA21'!E63","v":9595124},{"$f":"'SA21'!F63","v":5252545},{"$f":"'SA21'!G63","v":5252545},{"$f":"'SA21'!H63","v":5252545},{"$f":"'SA21'!I63","v":0},{"$f":"'SA21'!J63","v":10000000},{"$f":"'SA21'!K63","v":10610000},{"$f":"'SA21'!L63","v":11257210}]
["Total transfers and grants",1,{"$f":"SUM(C91:C92)","v":6746501},{"$f":"SUM(D91:D92)","v":3547907},9595124,5252545,5252545,5252545,0,10000000,10610000,11257210]
[]
[{"$f":"'A4-FinPerf RE'!A32","v":"Contracted services"}]
["List services provided by contract"]
[]
[]
[]
[]
[]
[]
[]
[]
[]
[]
[]
[]
[]
[]
[]
[]
[]
[]
[]
[]
[]
[]
[]
[]
["sub-total",1,{"$f":"SUM(C96:C120)","v":0},0,0,0,0,0,0,0,0,0]
["Allocations to organs of state:"]
["Electricity"]
["Water"]
["Sanitation"]
["Other"]
["Total contracted services",null,{"$f":"SUM(C121:C126)","v":0},{"$f":"SUM(D121:D126)","v":0},0,0,0,0,0,0,0,0]
[]
["Other Expenditure By Type"]
["Collection costs"]
["Contributions to 'other' provisions"]
["Consultant fees",null,null,null,null,350000,350000,350000,null,300000,318300,337716.3]
["Audit fees",null,null,null,null,2190000,1620000,2190000,null,500000,530500,562860.5]
["General expenses",3,25942871,31472010,{"$f":"39259800+20000","v":39279800},13390664,8709000,13390664,null,5900771.8866496086,6048517.3575160503,6417476.5044532418]
["Postage,Telephone,Advertisement, Stationery",null,null,null,null,4200000,4200000,4200000,null,2950000,3129950,3320876.95]
["Affiliation,Bursaries,Workshop & Publication",null,11206908,null,null,1590000,1590000,1590000,null,{"$f":"50000+300000+300000+1500000+50000","v":2200000},{"$f":"53050+530500+318300+1591500+53050","v":2546400},{"$f":"56286.05+562860.5+337716.3+1688581.5+56286.05","v":2701730.4}]
["Agri,LED,Policies,Skills,SMME,Tourism,IDP",null,null,null,null,1630000,1630000,1630000,null,1010000,1071610,1136978.21]
["Special Programmes, youth programmes, operation hlasela, public participation, ward committees ",null,null,null,null,8150000,8150000,8150000,null,4625000,4907125,5206459.625]
["Entertainment,Refreshment,Donations",null,null,null,null,300000,300000,300000,null,200000,212200,225144.19999999998]
["Mayoral projects & Imbizo",null,null,null,null,1500000,1500000,1500000,null,1000000,1061000,1125721]
["Repairs & Maintenance",null,null,32876637,24254521,13885000,20273000,13885000,null,18240254.91,20718100.459509999,23950499.582540113]
["FMG Expenditure"]
["security Services",null,null,null,null,250000,250000,250000,null,250000,265250,281430.25]
["travel & Subsistance",null,null,null,null,2660000,2675000,2660000,null,2472500,2912315,3067969.0049999994]
["EPWP",null,null,null,null,500000,1000000,500000,null,1000000,1061000,1125721]
["Dustbins",null,null,null,null,1350000,1350000,1350000,null,500000,530500,562860.5]
["Water chemicals",null,null,null,null,3000000,4000000,3000000,null,2500000,2652500,2814302.5]
["Fuel",null,null,null,null,2500000,3000000,2500000,null,2000000,2122000,2251442]
["Protective Clothing & overalls",null,null,null,null,1500000,1500000,1500000,null,1800000,1909800,2026297.7999999998]
["Youth Summit,programmes and talent search"]
["Planning & Surveying of ervens, land audit, housig sector plans and LUMS",null,null,null,null,1300000,500000,1300000,null,150000,159150,168858.15]
["Street Naming and Numbering",null,null,null,null,null,null,null,null,100000,106100,112572.09999999999]
["Insurance & legal costs",null,null,null,null,2700000,3000000,2700000,null,2000000,2122000,2251442]
["Bank charges",null,null,null,null,400000,300000,400000,null,250000,265250,281430.25]
["IT Expenses",null,null,null,null,2500000,1750000,2500000,null,750000,780500,828110.5]
["Office equipment / Plant/ Machinery/Vehicle rentals",null,null,null,null,9094000,11320000,9094000,null,6930000,7546630,7988674.4299999997]
["Total 'Other' Expenditure",1,{"$f":"SUM(C130:C156)","v":37149779},{"$f":"SUM(D130:D156)","v":64348647},63534321,74939664,78967000,74939664,0,57628526.796649605,62976697.817026049,68746573.756993353]
[]
["Repairs and Maintenance \nby Expenditure Item",8]
["Employee related costs"]
["Other materials"]
["Contracted Services"]
["Other Expenditure",null,null,32876637,24254521,13885000,20272500,null,null,18240254.91,20718100.459509999,23950499.582540113]
["Total Repairs and Maintenance Expenditure",9,{"$f":"SUM(C160:C163)","v":0},{"$f":"SUM(D160:D163)","v":32876637},24254521,13885000,20272500,0,0,18240254.91,20718100.459509999,23950499.582540113]
[]
["check",null,{"$f":"C164-SA34c!C77","v":-11206908},{"$f":"D164-SA34c!D77","v":454},{"$f":"E164-SA34c!E77","v":24254521},{"$f":"F164-SA34c!F77","v":0},{"$f":"G164-SA34c!G77","v":6387500},{"$f":"H164-SA34c!H77","v":-13885000},null,{"$f":"J164-SA34c!I77","v":-255},{"$f":"K164-SA34c!J77","v":-282.00049000233412},{"$f":"L164-SA34c!K77","v":-289.53745988756418}]
[]
[]
[{"$f":"head27a","v":"References"}]
["1. Must reconcile with 'Budgeted Financial Performance (Revenue and Expenditure)"]
["2. Must reconcile to supporting documentation on staff salaries"]
["3. Insert other categories where revenue or expenditure is of a material nature (list separate items until 'General expenses' is not > 10% of Total Expenditure)"]
["4. Expenditure to meet any 'unfunded obligations'"]
["5 This sub-total must agree with the total on SA22, but excluding councillor and board member items"]
["6. Include a note for each revenue item that is affected by 'revenue foregone'"]
["7. Special consideration may have to be given to including 'goodwill arising' or 'joint venture' budgets where circumstances require this (include separately under relevant notes)"]
["8. Repairs and Maintenance is not a GRAP item. However to facilitate transparency, municipalities must provide a breakdown of the amounts included in the relevant GRAP items that will be spent on Repairs and Maintenance."]
["9. Must reconcile with Repairs and Maintenance by Asset Class (Total Repairs and Maintenance) on Table SA34c."]
["10. Only applicable to municipalities that have adopted the 'revaluation method' in GRAP 17. The aim is to prevent overstating 'depreciation and asset impairment'"]

{"sheet":"SA2","index":20,"n_rows":45,"n_cols":18,"rows_kept":45,"cut":false,"hidden":false,"merged":[[1,16,2,16],[1,17,2,17],[1,8,2,8],[1,9,2,9],[1,10,2,10],[1,11,2,11],[1,12,2,12],[1,13,2,13],[1,14,2,14],[1,15,2,15],[1,6,2,6],[1,7,2,7],[1,2,2,2],[1,3,2,3],[1,4,2,4],[1,5,2,5]]}
[{"$f":"muni&\" - \"&TableA2","v":"FS205 Mafube - Supporting Table SA2 Matrix Financial Performance Budget (revenue source/expenditure type and dept.)"}]
[{"$f":"desc","v":"Description"},{"$f":"head27","v":"Ref"},{"$f":"'A3-FinPerf V'!A5","v":"Vote 1 - OFFICE OF THE MAYOR"},{"$f":"'A3-FinPerf V'!A6","v":"Vote 2 - OFFICE OF THE SPEAKER"},{"$f":"'A3-FinPerf V'!A7","v":"Vote 3 - OFFICE OF THE MUNICIPAL MANAGER"},{"$f":"'A3-FinPerf V'!A8","v":"Vote 4 - COMMUNITY SERVICES"},{"$f":"'A3-FinPerf V'!A9","v":"Vote 5 - CORPORATE SERVICES"},{"$f":"'A3-FinPerf V'!A10","v":"Vote 6 - FINANCIAL SERVICES"},{"$f":"'A3-FinPerf V'!A11","v":"Vote 7 - INFRASTRUCTURE SERVICES"},{"$f":"'A3-FinPerf V'!A12","v":"Vote 8 - SERVICE DELIVERY AND PUBLIC SAFETY"},{"$f":"'A3-FinPerf V'!A13","v":"Vote 9 - [NAME OF VOTE 9]"},{"$f":"'A3-FinPerf V'!A14","v":"Vote 10 - [NAME OF VOTE 10]"},{"$f":"'A3-FinPerf V'!A15","v":"Vote 11 - [NAME OF VOTE 11]"},{"$f":"'A3-FinPerf V'!A16","v":"Vote 12 - [NAME OF VOTE 12]"},{"$f":"'A3-FinPerf V'!A17","v":"Vote 13 - [NAME OF VOTE 13]"},{"$f":"'A3-FinPerf V'!A18","v":"Vote 14 - [NAME OF VOTE 14]"},{"$f":"'A3-FinPerf V'!A19","v":"Vote 15 - [NAME OF VOTE 15]"},"Total"]
["R thousand",1,"R'000","R'000","R'000","R'000","R'000","R'000",null,null,null,null,null,null,null,null,"R'000","R'000"]
[{"$f":"'A4-FinPerf RE'!A4","v":"Revenue By Source"}]
[{"$f":"'A4-FinPerf RE'!A5","v":"Property rates"},null,null,null,null,null,null,27251401,null,null,null,null,null,null,null,null,null,{"$f":"SUM(C5:Q5)","v":27251401}]
[{"$f":"'A4-FinPerf RE'!A6","v":"Property rates - penalties & collection charges"},null,null,null,null,null,null,null,null,null,null,null,null,null,null,null,null,{"$f":"SUM(C6:Q6)","v":0}]
[{"$f":"'A4-FinPerf RE'!A7","v":"Service charges - electricity revenue"},null,null,null,null,null,null,null,null,null,null,null,null,null,null,null,null,0]
[{"$f":"'A4-FinPerf RE'!A8","v":"Service charges - water revenue"},null,null,null,null,null,null,null,24507784.34,null,null,null,null,null,null,null,null,24507784.34]
[{"$f":"'A4-FinPerf RE'!A9","v":"Service charges - sanitation revenue"},null,null,null,null,18860498.710000001,null,null,null,null,null,null,null,null,null,null,null,18860498.710000001]
[{"$f":"'A4-FinPerf RE'!A10","v":"Service charges - refuse revenue"},null,null,null,null,13694143.57,null,null,null,null,null,null,null,null,null,null,null,13694143.57]
[{"$f":"'A4-FinPerf RE'!A11","v":"Service charges - other"},null,null,null,null,null,null,null,null,null,null,null,null,null,null,null,null,0]
[{"$f":"'A4-FinPerf RE'!A12","v":"Rental of facilities and equipment"},null,null,null,null,null,null,309217.37,null,null,null,null,null,null,null,null,null,309217.37]
[{"$f":"'A4-FinPerf RE'!A13","v":"Interest earned - external investments"},null,null,null,null,null,null,214242.96,null,null,null,null,null,null,null,null,null,214242.96]
[{"$f":"'A4-FinPerf RE'!A14","v":"Interest earned - outstanding debtors"},null,null,null,null,null,null,27412878.280000001,null,null,null,null,null,null,null,null,null,27412878.280000001]
[{"$f":"'A4-FinPerf RE'!A15","v":"Dividends received"},null,null,null,null,null,null,0,null,null,null,null,null,null,null,null,null,0]
[{"$f":"'A4-FinPerf RE'!A16","v":"Fines"},null,null,null,null,null,null,75000,null,null,null,null,null,null,null,null,null,75000]
[{"$f":"'A4-FinPerf RE'!A17","v":"Licences and permits"},null,null,null,null,null,null,null,null,null,null,null,null,null,null,null,null,0]
[{"$f":"'A4-FinPerf RE'!A18","v":"Agency services"},null,null,null,null,null,null,0,null,null,null,null,null,null,null,null,null,0]
[{"$f":"'A4-FinPerf RE'!A20","v":"Other revenue"},null,null,null,null,null,null,7632138.6782929897,null,null,null,null,null,null,null,null,null,7632138.6782929897]
[{"$f":"'A4-FinPerf RE'!A19","v":"Transfers recognised - operational"},null,null,null,null,null,null,83172000,null,null,null,null,null,null,null,null,null,83172000]
[{"$f":"'A4-FinPerf RE'!A21","v":"Gains on disposal of PPE"},null,null,null,null,null,null,null,null,null,null,null,null,null,null,null,null,0]
[{"$f":"'A4-FinPerf RE'!A22","v":"Total Revenue (excluding capital transfers and contributions)"},null,{"$f":"SUM(C5:C21)","v":0},0,0,32554642.280000001,0,146066878.288293,24507784.34,0,0,0,0,0,0,0,0,203129304.90829301]
[]
[{"$f":"'A4-FinPerf RE'!A24","v":"Expenditure By Type"}]
[{"$f":"'A4-FinPerf RE'!A25","v":"Employee related costs"},null,1984762,2659136,39301142.419412002,8127600,10813167,8244846,14659950,null,null,null,null,null,null,null,null,{"$f":"SUM(C25:Q25)","v":85790603.419412002}]
[{"$f":"'A4-FinPerf RE'!A26","v":"Remuneration of councillors"},null,null,5985277,null,null,null,null,null,null,null,null,null,null,null,null,null,{"$f":"SUM(C26:Q26)","v":5985277}]
[{"$f":"'A4-FinPerf RE'!A27","v":"Debt impairment"},null,null,null,null,null,null,6569356,null,null,null,null,null,null,null,null,null,6569356]
[{"$f":"'A4-FinPerf RE'!A28","v":"Depreciation & asset impairment"},null,null,null,null,null,null,38259177,null,null,null,null,null,null,null,null,null,38259177]
[{"$f":"'A4-FinPerf RE'!A29","v":"Finance charges"},null,null,null,null,null,null,3298072,null,null,null,null,null,null,null,null,null,3298072]
[{"$f":"'A4-FinPerf RE'!A30","v":"Bulk purchases"},null,null,null,null,null,null,null,6000000,null,null,null,null,null,null,null,null,6000000]
[{"$f":"'A4-FinPerf RE'!A31","v":"Other materials"},null,null,null,null,null,null,null,null,null,null,null,null,null,null,null,null,0]
[{"$f":"'A4-FinPerf RE'!A32","v":"Contracted services"},null,null,null,null,null,null,null,null,null,null,null,null,null,null,null,null,0]
[{"$f":"'A4-FinPerf RE'!A33","v":"Transfers and grants"},null,null,null,null,null,null,10000000,null,null,null,null,null,null,null,null,null,10000000]
[{"$f":"'A4-FinPerf RE'!A34","v":"Other expenditure"},null,5149999.7160999998,1374998.8258999996,6300000,3105000.1481999997,20294999.696400002,4105769.988499999,17297755.1241,null,null,null,null,null,null,null,null,57628523.499200001]
[{"$f":"'A4-FinPerf RE'!A35","v":"Loss on disposal of PPE"},null,null,null,null,null,null,null,null,null,null,null,null,null,null,null,null,0]
["Total Expenditure",null,{"$f":"SUM(C25:C35)","v":7134761.7160999998},10019411.8259,45601142.419412002,11232600.1482,31108166.696400002,70477220.988499999,37957705.1241,0,0,0,0,0,0,0,0,213531008.918612]
[]
[{"$f":"'A4-FinPerf RE'!A38","v":"Surplus/(Deficit)"},null,{"$f":"C22-C36","v":-7134761.7160999998},-10019411.8259,-45601142.419412002,21322042.131800003,-31108166.696400002,75589657.299793005,{"$f":"I22-I36","v":-13449920.7841},0,0,0,0,0,0,0,0,{"$f":"R22-R36","v":-10401704.010318995}]
[{"$f":"'A4-FinPerf RE'!A39","v":"Transfers recognised - capital"},null,null,null,null,null,null,null,32080000,null,null,null,null,null,null,null,null,{"$f":"SUM(C39:Q39)","v":32080000}]
[{"$f":"'A4-FinPerf RE'!A40","v":"Contributions recognised - capital"},null,null,null,null,null,null,null,null,null,null,null,null,null,null,null,null,{"$f":"SUM(C40:Q40)","v":0}]
[{"$f":"'A4-FinPerf RE'!A41","v":"Contributed assets"},null,null,null,null,null,null,null,null,null,null,null,null,null,null,null,null,{"$f":"SUM(C41:Q41)","v":0}]
[{"$f":"'A4-FinPerf RE'!A42","v":"Surplus/(Deficit) after capital transfers & contributions"},null,{"$f":"SUM(C38:C41)","v":-7134761.7160999998},-10019411.8259,-45601142.419412002,21322042.131800003,-31108166.696400002,75589657.299793005,18630079.2159,0,0,0,0,0,0,0,{"$f":"SUM(Q38:Q41)","v":0},{"$f":"SUM(R38:R41)","v":21678295.989681005}]
[{"$f":"head27a","v":"References"}]
["1. Departmental columns to be based on municipal organisation structure"]
["check balance",null,null,null,null,null,null,null,null,null,null,null,null,null,null,null,null,{"$f":"'A4-FinPerf RE'!J42-'SA2'!R42","v":-2.0861625671386719E-7}]

{"sheet":"SA3","index":21,"n_rows":82,"n_cols":12,"rows_kept":82,"cut":false,"hidden":false,"merged":[[1,0,2,0],[1,1,2,1],[1,9,1,11],[1,5,1,8]]}
[{"$f":"muni&\" - \"&TableA3","v":"FS205 Mafube - Supporting Table SA3 Supportinging detail to 'Budgeted Financial Position'"}]
[{"$f":"desc","v":"Description"},{"$f":"head27","v":"Ref"},{"$f":"head1b","v":"2013/14"},{"$f":"head1A","v":"2014/15"},{"$f":"Head1","v":"2015/16"},{"$f":"Head2","v":"Current Year 2016/17"},null,null,null,{"$f":"Head3","v":"2017/18 Medium Term Revenue & Expenditure Framework"}]
[null,null,{"$f":"Head5","v":"Audited Outcome"},{"$f":"Head5","v":"Audited Outcome"},{"$f":"Head5","v":"Audited Outcome"},{"$f":"Head6","v":"Original Budget"},{"$f":"Head7","v":"Adjusted Budget"},{"$f":"Head8","v":"Full Year Forecast"},{"$f":"Head5b","v":"Pre-audit outcome"},{"$f":"Head9","v":"Budget Year 2017/18"},{"$f":"Head10","v":"Budget Year +1 2018/19"},{"$f":"Head11","v":"Budget Year +2 2019/20"}]
["R thousand"]
["ASSETS"]
[{"$f":"'A6-FinPos'!A7","v":"Call investment deposits"}]
["Call deposits < 90 days",null,31415,28845,548289,591083,591083,591083,0,591083,591083,591083]
["Other current investments > 90 days"]
[{"$f":"\"Total \"&A6","v":"Total Call investment deposits"},2,{"$f":"SUM(C7:C8)","v":31415},{"$f":"SUM(D7:D8)","v":28845},548289,591083,591083,591083,0,591083,591083,591083]
[]
[{"$f":"'A6-FinPos'!A8","v":"Consumer debtors"}]
[{"$f":"A11","v":"Consumer debtors"},null,35926954,63954782,120617069,63954782,61921782,61921782,7017918,63954782,63954782,63954782]
["Less: Provision for debt impairment",null,null,null,null,null,0,null,null,-733000,-733000,-733000]
[{"$f":"\"Total \"&A11","v":"Total Consumer debtors"},2,{"$f":"SUM(C12:C13)","v":35926954},{"$f":"SUM(D12:D13)","v":63954782},120617069,{"$f":"SUM(F12:F13)","v":63954782},61921782,61921782,7017918,63221782,63221782,63221782]
[]
["Debt impairment provision"]
["Balance at the beginning of the year",null,1153361203,1305983570,1314727780,1962536469,1962536469,null,null,1962536469,1962536469,1962536469]
["Contributions to the provision",null,null,null,null,null,0,null,null,0,0,0]
["Bad debts written off",null,null,603874570,641116891,918408731,918408731,null,null,918408731,918408731,918408731]
["Balance at end of year",null,{"$f":"SUM(C17:C19)","v":1153361203},{"$f":"SUM(D17:D19)","v":1909858140},1955844671,2880945200,2880945200,0,0,2880945200,2880945200,2880945200]
[]
[{"$f":"'A6-FinPos'!A19&\" (PPE)\"","v":"Property, plant and equipment (PPE)"}]
["PPE at cost/valuation (excl. finance leases)",null,1153361203,{"$f":"702109371+603875000","v":1305984371},{"$f":"673610889+641117000","v":1314727889},{"$f":"1044127738+918409000","v":1962536738},{"$f":"1044127738+918409000","v":1962536738},1044127738,null,1962536469,1962536469,1962536469]
["Leases recognised as PPE",3,null,null,null,null,0,null,null,0,0,0]
["Less: Accumulated depreciation",null,null,603874570,641116891,918408731,918408731,null,null,918408731,918408731,918408731]
[{"$f":"\"Total \"&A22","v":"Total Property, plant and equipment (PPE)"},2,{"$f":"SUM(C23:C24)-C25","v":1153361203},{"$f":"SUM(D23:D24)-D25","v":702109801},673610998,1044128007,1044128007,1044127738,0,1044127738,1044127738,1044127738]
[]
["LIABILITIES"]
[{"$f":"'A6-FinPos'!A28&\" - \"&'A6-FinPos'!A30","v":"Current liabilities - Borrowing"}]
["Short term loans (other than bank overdraft)",null,null,null,null,null,null,null,null,809536,809536,809536]
["Current portion of long-term liabilities",null,1132167,809536,263581,809536,809536,809536]
[{"$f":"\"Total \"&A29","v":"Total Current liabilities - Borrowing"},null,{"$f":"SUM(C30:C31)","v":1132167},{"$f":"SUM(D30:D31)","v":809536},263581,809536,809536,809536,0,809536,809536,809536]
[]
[{"$f":"'A6-FinPos'!A32","v":"Trade and other payables"}]
["Trade and other creditors",null,216593494,293585456,375354982,58768059,58768059,58768059,-10640943,58768059,58768059,58768059]
["Unspent conditional transfers"]
["VAT"]
[{"$f":"\"Total \"&A34","v":"Total Trade and other payables"},2,{"$f":"SUM(C35:C37)","v":216593494},293585456,375354982,58768059,58768059,58768059,-10640943,58768059,58768059,{"$f":"SUM(L35:L37)","v":58768059}]
[]
[{"$f":"'A6-FinPos'!A36&\" - \"&'A6-FinPos'!A37","v":"Non current liabilities - Borrowing"}]
["Borrowing",4,2190411,1316665,764702,2506575,2506575,2506575,152986,1608706,1608706,1608706]
["Finance leases (including PPP asset element)",null,null,null,null,0,0,null,null,897869,897869,897869]
[{"$f":"\"Total \"&A40","v":"Total Non current liabilities - Borrowing"},null,{"$f":"SUM(C41:C42)","v":2190411},{"$f":"SUM(D41:D42)","v":1316665},764702,2506575,2506575,2506575,152986,2506575,2506575,2506575]
[]
[{"$f":"'A6-FinPos'!A38&\" - non-current\"","v":"Provisions - non-current"}]
["Retirement benefits",null,23645333,24217687,24132241,13685857,13685857,13685857,null,13685857,13685857,13685857]
["List other major provision items"]
["Refuse landfill site rehabilitation"]
["Other"]
[{"$f":"\"Total \"&A45","v":"Total Provisions - non-current"},null,{"$f":"SUM(C46:C49)","v":23645333},24217687,24132241,13685857,13685857,13685857,0,13685857,13685857,13685857]
[]
["CHANGES IN NET ASSETS"]
[{"$f":"'A6-FinPos'!A45","v":"Accumulated Surplus/(Deficit)"}]
[{"$f":"A53&\" - opening balance\"","v":"Accumulated Surplus/(Deficit) - opening balance"}]
["GRAP adjustments"]
["Restated balance",null,{"$f":"SUM(C54:C55)","v":0},{"$f":"SUM(D54:D55)","v":0},{"$f":"SUM(E54:E55)","v":0},{"$f":"SUM(F54:F55)","v":0},0,0,0,0,0,0]
[{"$f":"'A4-FinPerf RE'!A38","v":"Surplus/(Deficit)"},null,{"$f":"'A4-FinPerf RE'!C46","v":-158841689},{"$f":"'A4-FinPerf RE'!D46","v":-54960990},{"$f":"'A4-FinPerf RE'!E46","v":-50080351},{"$f":"'A4-FinPerf RE'!F46","v":41955764.618598402},{"$f":"'A4-FinPerf RE'!G46","v":42132368.718598425},{"$f":"'A4-FinPerf RE'!H46","v":41955764.618598402},{"$f":"'A4-FinPerf RE'!I46","v":0},{"$f":"'A4-FinPerf RE'!J46","v":21678295.989680797},{"$f":"'A4-FinPerf RE'!K46","v":25067859.293210417},{"$f":"'A4-FinPerf RE'!L46","v":32645959.598852694}]
["Appropriations to Reserves"]
["Transfers from Reserves"]
["Depreciation offsets"]
["Other adjustments"]
["Accumulated Surplus/(Deficit)",1,{"$f":"SUM(C56:C61)","v":-158841689},{"$f":"SUM(D56:D61)","v":-54960990},{"$f":"SUM(E56:E61)","v":-50080351},41955764.618598402,42132368.718598425,41955764.618598402,0,21678295.989680797,25067859.293210417,32645959.598852694]
["Reserves"]
["Housing Development Fund"]
["Capital replacement"]
["Self-insurance"]
["Other reserves"]
["Revaluation"]
["Total Reserves",2,{"$f":"SUM(C64:C68)","v":0},0,0,0,0,0,0,0,0,0]
[{"$f":"'A6-FinPos'!A48","v":"TOTAL COMMUNITY WEALTH/EQUITY"},2,{"$f":"C62+C69","v":-158841689},-54960990,-50080351,41955764.618598402,42132368.718598425,41955764.618598402,0,21678295.989680797,25067859.293210417,32645959.598852694]
[]
["Total capital expenditure includes expenditure on nationally significant priorities:"]
["Provision of basic services"]
[]
[]
[{"$f":"head27a","v":"References"}]
[{"$f":"\"1. Must reconcile with \"&'Template names'!F103","v":"1. Must reconcile with Table A4 Budgeted Financial Performance (revenue and expenditure)"}]
[{"$f":"\"2. Must reconcile with \"&'Template names'!F105","v":"2. Must reconcile with Table A6 Budgeted Financial Position"}]
["3. Leases treated as assets to be depreciated as the same as purchased/constructed assets.  Includes PPP asset element accounted for as finance leases"]
["4. Borrowing must reconcile to Table A17"]
["check",null,{"$f":"C70-'A6-FinPos'!C48","v":-1165784168},{"$f":"D70-'A6-FinPos'!D48","v":-587387853},{"$f":"E70-'A6-FinPos'!E48","v":-540751445},{"$f":"F70-'A6-FinPos'!F48","v":-1056971876.3814015},{"$f":"G70-'A6-FinPos'!G48","v":-1054762272.2814016},{"$f":"H70-'A6-FinPos'!H48","v":-1054938876.3814015},{"$f":"I70-'A6-FinPos'!I48","v":-21947782},{"$f":"J70-'A6-FinPos'!J48","v":-1076516345.0103192},{"$f":"K70-'A6-FinPos'!K48","v":-1073126781.7067896},{"$f":"L70-'A6-FinPos'!L48","v":-1065548681.4011474}]
[null,null,{"$f":"TREND(D82:H82)","v":0},{"$f":"TREND(E82:H82)","v":0},{"$f":"E73","v":0},{"$f":"H73","v":0},{"$f":"J73","v":0},{"$f":"K73","v":0},{"$f":"L73","v":0}]

{"sheet":"SA4","index":22,"n_rows":26,"n_cols":13,"rows_kept":26,"cut":false,"hidden":false,"merged":[[1,7,1,9],[1,10,1,12],[1,3,2,3]]}
[{"$f":"muni&\" - \"&TableA4","v":"FS205 Mafube - Supporting Table SA4 Reconciliation of IDP strategic objectives and budget (revenue)"}]
["Strategic Objective","Goal","Goal\nCode",{"$f":"head27","v":"Ref"},{"$f":"head1b","v":"2013/14"},{"$f":"head1A","v":"2014/15"},{"$f":"Head1","v":"2015/16"},{"$f":"Head2","v":"Current Year 2016/17"},null,null,{"$f":"Head3","v":"2017/18 Medium Term Revenue & Expenditure Framework"}]
["R thousand",null,null,null,{"$f":"Head5","v":"Audited Outcome"},{"$f":"Head5","v":"Audited Outcome"},{"$f":"Head5","v":"Audited Outcome"},{"$f":"Head6","v":"Original Budget"},{"$f":"Head7","v":"Adjusted Budget"},{"$f":"Head8","v":"Full Year Forecast"},{"$f":"Head9","v":"Budget Year 2017/18"},{"$f":"Head10","v":"Budget Year +1 2018/19"},{"$f":"Head11","v":"Budget Year +2 2019/20"}]
["Supply of water and sanitation","number of households have access to water and sanitation, this also enhances municipal revenue",null,null,32082500,47990463,51164578,40874913.340000004,40874913.340000004,null,43368283.053740002,46013748.320018098,48820586.967539199]
[]
["Refuse removal","Refuse regularly collected, revenue enhancement",null,null,13862071,12814098,12583451,12906827.119999999,12906827.119999999,null,13694143.57,3063745.1217771401,3250633.5742055401]
[]
["Property rates","optimum revenue collected",null,null,19474278,21152561,22693193,27148890.66,27148890.66,null,28804972.990260001,30562076.3426659,32426362.9995685]
[]
["protection services","regulation of traffic and law enforcement around all mafube towns, additional sources of revenue",null,null,73870]
[]
["Debt and revenue management","accurate recovery of revenue owining to municipality and optimum revenue collected"]
["Municipal operations and indigent registration","subsidisation of basic services for indigent residents and support of municipal operations for sustainable service delivery",null,null,67799171,87144662,92467750,114862363.48999998,120262363.48999998,null,78462000,86124000,92261000]
[]
["Capacity Building","Development and improvement of municipal systems as well as personnel training and skills development",null,null,8555459,null,null,null,null,null,3710000,4033000,2860000]
[]
["Electricity Supply","Number of households have access to electricity, this also enhances municipal revenue",null,null,-102286]
[]
["Revenue enhancement","Revenue generation throughmeans other than provision of services ",null,null,37566473,20230010,26265795,null,null,null,35089905.294292778,47528142.844957352,50398301.907522649]
["Infrastructural Management","Infrastructure development"]
["Allocations to other priorities",null,null,2]
[{"$f":"'A4-FinPerf RE'!A22","v":"Total Revenue (excluding capital transfers and contributions)"},null,null,1,{"$f":"SUM(E4:E21)","v":179311536},189331794,205174767,195792994.60999998,201192994.60999998,0,203129304.9082928,217324712.62941849,230016885.44883588]
[{"$f":"head27a","v":"References"}]
[{"$f":"\"1. Total revenue must reconcile to \"&'Template names'!F103","v":"1. Total revenue must reconcile to Table A4 Budgeted Financial Performance (revenue and expenditure)"}]
["2. Balance of allocations not directly linked to an IDP strategic objective"]
["check op revenue balance",null,null,null,{"$f":"E22-'A4-FinPerf RE'!C60","v":234621},{"$f":"F22-'A4-FinPerf RE'!D60","v":-19909416},{"$f":"G22-'A4-FinPerf RE'!E60","v":-12635910},{"$f":"H22-'A4-FinPerf RE'!F60","v":-32422001.390000015},{"$f":"I22-'A4-FinPerf RE'!G60","v":-32422001.390000015},{"$f":"J22-'A4-FinPerf RE'!H60","v":-228214996},{"$f":"K22-'A4-FinPerf RE'!J60","v":-32080000},{"$f":"L22-'A4-FinPerf RE'!K60","v":-30874000},{"$f":"M22-'A4-FinPerf RE'!L60","v":-37037000}]

{"sheet":"SA5","index":23,"n_rows":27,"n_cols":13,"rows_kept":27,"cut":false,"hidden":false,"merged":[[1,7,1,9],[1,10,1,12],[1,3,2,3]]}
[{"$f":"muni&\" - \"&TableA5","v":"FS205 Mafube - Supporting Table SA5 Reconciliation of IDP strategic objectives and budget (operating expenditure)"}]
["Strategic Objective","Goal","Goal\nCode",{"$f":"head27","v":"Ref"},{"$f":"head1b","v":"2013/14"},{"$f":"head1A","v":"2014/15"},{"$f":"Head1","v":"2015/16"},{"$f":"Head2","v":"Current Year 2016/17"},null,null,{"$f":"Head3","v":"2017/18 Medium Term Revenue & Expenditure Framework"}]
["R thousand",null,null,null,{"$f":"Head5","v":"Audited Outcome"},{"$f":"Head5","v":"Audited Outcome"},{"$f":"Head5","v":"Audited Outcome"},{"$f":"Head6","v":"Original Budget"},{"$f":"Head7","v":"Adjusted Budget"},{"$f":"Head8","v":"Full Year Forecast"},{"$f":"Head9","v":"Budget Year 2017/18"},{"$f":"Head10","v":"Budget Year +1 2018/19"},{"$f":"Head11","v":"Budget Year +2 2019/20"}]
["Integrated Development Planning and Local Economic Development","Creation of a conducive environment for job creation and Economic development.",null,null,646377]
["Legislative compliance","Coordination and development of policies and by-laws"]
["Capacity building","Development and improvement of municipal systems as well as personnel training and skills development",null,null,740157,null,null,1590000,1350637,null,1800000,2122000,2251442]
["Povision of free basic services","Subsidisation of basic services for indigent residents ",null,null,6746501,3547907,9595124,5252545,5252545,null,10000000,10610000,11257210]
["Acquisition, repairs and maintenance of municipal assets","Acquire, upgrade and maintain municipal property and infrastructure to ensure sustainable service delivery",null,null,134293960,70162546,62513698,13885000,20272500,null,18240254.91,20718100.459509999,23950499.582540113]
["Community Based Planning","Training of municipal internal and external stakeholders as well as conducting social awareness campaigns and special programmes",null,null,1018374,null,null,9650000,8050000,null,5200000,5517200,5853749.2000000002]
["Financial reporting and compliance","Compilation of GRAP compliant financial statements and regulatory reporting",null,null,3281396,null,null,2190000,1620000,null,1700000,1803700,1913725.7]
["communication, corporate and financial administration","Enhancement of communication with internal and external stakeholders as well as facilitation of municipal finance and corporate administration",null,null,55886511,13006204,22172992,9800000,9350000,0,4250000,4509250,4784314.25]
["Protection Services","Ensure public safety and protection",null,null,64476,null,null,null,250000,null,250000,265250,281430.25]
["Spatial development and town planning","Planning and surveying of ervens",null,null,null,null,null,null,null,null,500000,530500,562860.5]
["Access to municipal services","Provision of municipal services to all households",null,null,27714956]
["Servicel delivery","Funding municipal day-to-day operations to ensure sustained service delivery",null,null,82103808,146908193,135231405,143891686.38140199,145336008.862142,null,171590754.00861201,177054852.87669808,183552694.36744308]
[]
[]
[]
[]
[]
[]
["Allocations to other priorities"]
[{"$f":"'A4-FinPerf RE'!A36","v":"Total Expenditure"},null,null,1,{"$f":"SUM(E4:E22)","v":312496516},233624850,229513219,186259231.38140199,191481690.862142,0,213531008.918612,223130853.33620808,234407925.84998322]
[{"$f":"head27a","v":"References"}]
[{"$f":"\"1. Total expenditure must reconcile to \"&'Template names'!F103","v":"1. Total expenditure must reconcile to Table A4 Budgeted Financial Performance (revenue and expenditure)"}]
["2. Balance of allocations not directly linked to an IDP strategic objective"]
["check op expenditure balance",null,null,null,{"$f":"E23-'A4-FinPerf RE'!C36","v":-25422088},{"$f":"F23-'A4-FinPerf RE'!D36","v":-30577350},{"$f":"G23-'A4-FinPerf RE'!E36","v":-38377809},{"$f":"H23-'A4-FinPerf RE'!F36","v":3.8743019104003906E-7},{"$f":"I23-'A4-FinPerf RE'!G36","v":-936.41925957798958},{"$f":"J23-'A4-FinPerf RE'!H36","v":-186259231.3814016},{"$f":"K23-'A4-FinPerf RE'!J36","v":0},{"$f":"L23-'A4-FinPerf RE'!K36","v":0},{"$f":"M23-'A4-FinPerf RE'!L36","v":0}]

{"sheet":"SA6","index":24,"n_rows":26,"n_cols":13,"rows_kept":26,"cut":false,"hidden":false,"merged":[[1,7,1,9],[1,10,1,12],[1,3,2,3]]}
[{"$f":"muni&\" - \"&TableA6","v":"FS205 Mafube - Supporting Table SA6 Reconciliation of IDP strategic objectives and budget (capital expenditure)"}]
["Strategic Objective","Goal","Goal Code",{"$f":"head27","v":"Ref"},{"$f":"head1b","v":"2013/14"},{"$f":"head1A","v":"2014/15"},{"$f":"Head1","v":"2015/16"},{"$f":"Head2","v":"Current Year 2016/17"},null,null,{"$f":"Head3","v":"2017/18 Medium Term Revenue & Expenditure Framework"}]
["R thousand",null,null,null,{"$f":"Head5","v":"Audited Outcome"},{"$f":"Head5","v":"Audited Outcome"},{"$f":"Head5","v":"Audited Outcome"},{"$f":"Head6","v":"Original Budget"},{"$f":"Head7","v":"Adjusted Budget"},{"$f":"Head8","v":"Full Year Forecast"},{"$f":"Head9","v":"Budget Year 2017/18"},{"$f":"Head10","v":"Budget Year +1 2018/19"},{"$f":"Head11","v":"Budget Year +2 2019/20"}]
["Electrification","Upgrading of bulk infrastructure","A",null,null,null,null,4000000,4000000,null,5000000,7000000,12000000]
["Electrification","Provision of street lighting and ensuring community safety as well as energy efficiency","B"]
["Upgrading of sports facilities","Upgrading and rehabilitation of sports facilities for social development","C",null,null,null,null,3297255.05,3566816.05,null,7224070.7199999997,1074330,1126665]
["Landfill Site Management","Rehabilitation of landfill sites","D"]
["Road infrastructure development","Upgrading of gravel to paved roads","E"]
["Institutional development","Construction of municipal offices","F",null,null,null,null,3000000,2300000]
["High mast lights","Provision and maintenance of migh mast lights around  the streets for safety ","G"]
["Provision of access to clean water","Construction of a new water reservoir in Villiers to address backlogs","H",null,null,null,null,10027686.960000001,1526876.9600000009,null,992331.67,10353897.859999999,18580105]
["Fencing of parks and cemetries","To ensure safeguarding of  community resources","I",null,null,null,null,200000,211000]
["Provision of sanitation services","Construction of a Waste Water Treatment Plant in Villiers","J",null,null,null,null,null,null,null,17509597.609999999,8293989.29,2622000]
["Expanded Public works programme","Creation of temporary jobs and skills development","K"]
["Other municipal assets","Acquisition of new municipal assets and systems for improved service delivery and capacity building","L",null,2318560,1425967,1202524,21578439,23296306,null,2731825.5199999996,2509383.7800000003,2730796.72805552]
["Other Infrastructure assets","To build/clean the weir in the Vaal river for facilitation of water purification","M",null,23323464,12656687,7829391]
["Project management and creation of jobs","Management  and overseeing of infrastructural projects as well as creation of interim infrastructure jobs and training through EPWP initiative","N"]
[null,null,"O"]
[null,null,"P"]
["Allocations to other priorities",null,null,3]
["Total Capital Expenditure",null,null,1,{"$f":"SUM(E4:E20)","v":25642024},14082654,9031915,42103381.010000005,34900999.010000005,0,33457825.52,29231600.93,37059566.728055522]
[{"$f":"head27a","v":"References"}]
["1. Total capital expenditure must reconcile to Budgeted Capital Expenditure"]
["2. Goal code must be used on Table SA36"]
["3. Balance of allocations not directly linked to an IDP strategic objective"]
["check capital balance",null,null,null,{"$f":"E21-'A5-Capex'!C40","v":0},{"$f":"F21-'A5-Capex'!D40","v":0},{"$f":"G21-'A5-Capex'!E40","v":0},{"$f":"H21-'A5-Capex'!F40","v":171746.01000000536},{"$f":"I21-'A5-Capex'!G40","v":-7210635.9899999946},{"$f":"J21-'A5-Capex'!H40","v":0},{"$f":"K21-'A5-Capex'!J40","v":365912.76240000129},{"$f":"L21-'A5-Capex'!K40","v":-2764390.9551759996},{"$f":"M21-'A5-Capex'!L40","v":-1216702.6359722391}]

{"sheet":"SA7","index":25,"n_rows":89,"n_cols":11,"rows_kept":89,"cut":false,"hidden":false,"merged":[[1,1,2,1],[1,0,2,0],[1,5,1,7],[1,8,1,10],[87,0,87,10],[67,0,67,10],[72,0,73,0],[72,1,73,1],[72,5,72,7],[72,8,72,10]]}
[{"$f":"muni&\" - \"&TableA7","v":"FS205 Mafube - Supporting Table SA7 Measureable performance objectives"}]
["Description","Unit of measurement",{"$f":"head1b","v":"2013/14"},{"$f":"head1A","v":"2014/15"},{"$f":"Head1","v":"2015/16"},{"$f":"Head2","v":"Current Year 2016/17"},null,null,{"$f":"Head3","v":"2017/18 Medium Term Revenue & Expenditure Framework"}]
[null,null,{"$f":"Head5","v":"Audited Outcome"},{"$f":"Head5","v":"Audited Outcome"},{"$f":"Head5","v":"Audited Outcome"},{"$f":"Head6","v":"Original Budget"},{"$f":"Head7","v":"Adjusted Budget"},{"$f":"Head8","v":"Full Year Forecast"},{"$f":"Head9","v":"Budget Year 2017/18"},{"$f":"Head10","v":"Budget Year +1 2018/19"},{"$f":"Head11","v":"Budget Year +2 2019/20"}]
["Vote 1 - vote name"]
["Function 1 - (name)"]
["Sub-function 1 - (name)"]
["Insert measure/s description"]
[]
["Sub-function 2 - (name)"]
["Insert measure/s description"]
[]
["Sub-function 3 - (name)"]
["Insert measure/s description"]
[]
["Function 2 - (name)"]
["Sub-function 1 - (name)"]
["Insert measure/s description"]
[]
["Sub-function 2 - (name)"]
["Insert measure/s description"]
[]
["Sub-function 3 - (name)"]
["Insert measure/s description"]
[]
["Vote 2 - vote name"]
["Function 1 - (name)"]
["Sub-function 1 - (name)"]
["Insert measure/s description"]
[]
["Sub-function 2 - (name)"]
["Insert measure/s description"]
[]
["Sub-function 3 - (name)"]
["Insert measure/s description"]
[]
["Function 2 - (name)"]
["Sub-function 1 - (name)"]
["Insert measure/s description"]
[]
["Sub-function 2 - (name)"]
["Insert measure/s description"]
[]
["Sub-function 3 - (name)"]
["Insert measure/s description"]
[]
["Vote 3 - vote name"]
["Function 1 - (name)"]
["Sub-function 1 - (name)"]
["Insert measure/s description"]
[]
["Sub-function 2 - (name)"]
["Insert measure/s description"]
[]
["Sub-function 3 - (name)"]
["Insert measure/s description"]
[]
["Function 2 - (name)"]
["Sub-function 1 - (name)"]
["Insert measure/s description"]
[]
["Sub-function 2 - (name)"]
["Insert measure/s description"]
[]
["Sub-function 3 - (name)"]
["Insert measure/s description"]
[]
["And so on for the rest of the Votes"]
["1. Include a measurable performance objective for each revenue source (within a relevant function) and each vote (MFMA s17(3)(b))"]
["2. Include all Basic Services performance targets from 'Basic Service Delivery' to ensure Table SA7 represents all strategic responsibilities"]
["3. Only include prior year comparative information for individual measures where relevant activity occurred in that year/s"]
[]
[{"$f":"muni&\" - \"&\"Entities measureable performance objectives\"","v":"FS205 Mafube - Entities measureable performance objectives"}]
[{"$f":"A2","v":"Description"},"Unit of measurement",{"$f":"head1b","v":"2013/14"},{"$f":"head1A","v":"2014/15"},{"$f":"Head1","v":"2015/16"},{"$f":"Head2","v":"Current Year 2016/17"},null,null,{"$f":"Head3","v":"2017/18 Medium Term Revenue & Expenditure Framework"}]
[null,null,{"$f":"Head5","v":"Audited Outcome"},{"$f":"Head5","v":"Audited Outcome"},{"$f":"Head5","v":"Audited Outcome"},{"$f":"Head6","v":"Original Budget"},{"$f":"Head7","v":"Adjusted Budget"},{"$f":"Head8","v":"Full Year Forecast"},{"$f":"Head9","v":"Budget Year 2017/18"},{"$f":"Head10","v":"Budget Year +1 2018/19"},{"$f":"Head11","v":"Budget Year +2 2019/20"}]
["Entity 1 - (name of entity)"]
["Insert measure/s description"]
[]
[]
["Entity 2 - (name of entity)"]
[{"$f":"$A$10","v":"Insert measure/s description"}]
[]
[]
["Entity 3 - (name of entity)"]
[{"$f":"$A$10","v":"Insert measure/s description"}]
[]
[]
["And so on for the rest of the Entities"]
["1. Include a measurable performance objective as agreed with the parent municipality (MFMA s87(5)(d))"]
["2. Only include prior year comparative information for individual measures where relevant activity occurred in that year/s"]

{"sheet":"SA8","index":26,"n_rows":49,"n_cols":12,"rows_kept":49,"cut":false,"hidden":false,"merged":[[28,0,30,0],[1,0,2,0],[1,9,1,11],[1,1,2,1],[1,5,1,8],[25,0,27,0]]}
[{"$f":"muni&\" - \"&TableA8","v":"FS205 Mafube - Supporting Table SA8 Performance indicators and benchmarks"}]
["Description of financial indicator","Basis of calculation",{"$f":"head1b","v":"2013/14"},{"$f":"head1A","v":"2014/15"},{"$f":"Head1","v":"2015/16"},{"$f":"Head2","v":"Current Year 2016/17"},null,null,null,{"$f":"Head3","v":"2017/18 Medium Term Revenue & Expenditure Framework"}]
[null,null,{"$f":"Head5","v":"Audited Outcome"},{"$f":"Head5","v":"Audited Outcome"},{"$f":"Head5","v":"Audited Outcome"},{"$f":"Head6","v":"Original Budget"},{"$f":"Head7","v":"Adjusted Budget"},{"$f":"Head8","v":"Full Year Forecast"},{"$f":"Head5b","v":"Pre-audit outcome"},{"$f":"Head9","v":"Budget Year 2017/18"},{"$f":"Head10","v":"Budget Year +1 2018/19"},{"$f":"Head11","v":"Budget Year +2 2019/20"}]
["Borrowing Management"]
[]
["Credit Rating"]
["Capital Charges to Operating Expenditure","Interest & Principal Paid /Operating Expenditure",{"$f":"IF(ISERROR(('A4-FinPerf RE'!C29-'A7-CFlow'!C35)/'A4-FinPerf RE'!C36),0,(('A4-FinPerf RE'!C29-'A7-CFlow'!C35)/'A4-FinPerf RE'!C36))","v":3.9710015492369875E-2},{"$f":"IF(ISERROR(('A4-FinPerf RE'!D29-'A7-CFlow'!D35)/'A4-FinPerf RE'!D36),0,(('A4-FinPerf RE'!D29-'A7-CFlow'!D35)/'A4-FinPerf RE'!D36))","v":5.7709716270341431E-2},{"$f":"IF(ISERROR(('A4-FinPerf RE'!E29-'A7-CFlow'!E35)/'A4-FinPerf RE'!E36),0,(('A4-FinPerf RE'!E29-'A7-CFlow'!E35)/'A4-FinPerf RE'!E36))","v":8.1376738007067559E-2},{"$f":"IF(ISERROR(('A4-FinPerf RE'!F29-'A7-CFlow'!F35)/'A4-FinPerf RE'!F36),0,(('A4-FinPerf RE'!F29-'A7-CFlow'!F35)/'A4-FinPerf RE'!F36))","v":1.7240090470601169E-2},{"$f":"IF(ISERROR(('A4-FinPerf RE'!G29-'A7-CFlow'!G35)/'A4-FinPerf RE'!G36),0,(('A4-FinPerf RE'!G29-'A7-CFlow'!G35)/'A4-FinPerf RE'!G36))","v":1.5203081560615048E-2},{"$f":"IF(ISERROR(('A4-FinPerf RE'!H29-'A7-CFlow'!H35)/'A4-FinPerf RE'!H36),0,(('A4-FinPerf RE'!H29-'A7-CFlow'!H35)/'A4-FinPerf RE'!H36))","v":1.5629432046988908E-2},{"$f":"IF(ISERROR(('A4-FinPerf RE'!I29-'A7-CFlow'!I35)/'A4-FinPerf RE'!I36),0,(('A4-FinPerf RE'!I29-'A7-CFlow'!I35)/'A4-FinPerf RE'!I36))","v":0},{"$f":"IF(ISERROR(('A4-FinPerf RE'!J29-'A7-CFlow'!J35)/'A4-FinPerf RE'!J36),0,(('A4-FinPerf RE'!J29-'A7-CFlow'!J35)/'A4-FinPerf RE'!J36))","v":1.5445400725180249E-2},{"$f":"IF(ISERROR(('A4-FinPerf RE'!K29-'A7-CFlow'!K35)/'A4-FinPerf RE'!K36),0,(('A4-FinPerf RE'!K29-'A7-CFlow'!K35)/'A4-FinPerf RE'!K36))","v":1.5682521433857514E-2},{"$f":"IF(ISERROR(('A4-FinPerf RE'!L29-'A7-CFlow'!L35)/'A4-FinPerf RE'!L36),0,(('A4-FinPerf RE'!L29-'A7-CFlow'!L35)/'A4-FinPerf RE'!L36))","v":1.5838666276054448E-2}]
["Capital Charges to Own Revenue","Finance charges & Repayment of borrowing /Own Revenue",{"$f":"IF(ISERROR(('A4-FinPerf RE'!C29-'A7-CFlow'!C35)/('A4-FinPerf RE'!C22-'A4-FinPerf RE'!C19)),0,(('A4-FinPerf RE'!C29-'A7-CFlow'!C35)/('A4-FinPerf RE'!C22-'A4-FinPerf RE'!C19)))","v":0.16317946973564026},{"$f":"IF(ISERROR(('A4-FinPerf RE'!D29-'A7-CFlow'!D35)/('A4-FinPerf RE'!D22-'A4-FinPerf RE'!D19)),0,(('A4-FinPerf RE'!D29-'A7-CFlow'!D35)/('A4-FinPerf RE'!D22-'A4-FinPerf RE'!D19)))","v":0.14245870944376271},{"$f":"IF(ISERROR(('A4-FinPerf RE'!E29-'A7-CFlow'!E35)/('A4-FinPerf RE'!E22-'A4-FinPerf RE'!E19)),0,(('A4-FinPerf RE'!E29-'A7-CFlow'!E35)/('A4-FinPerf RE'!E22-'A4-FinPerf RE'!E19)))","v":0.18439328786750991},{"$f":"IF(ISERROR(('A4-FinPerf RE'!F29-'A7-CFlow'!F35)/('A4-FinPerf RE'!F22-'A4-FinPerf RE'!F19)),0,(('A4-FinPerf RE'!F29-'A7-CFlow'!F35)/('A4-FinPerf RE'!F22-'A4-FinPerf RE'!F19)))","v":2.810146332256214E-2},{"$f":"IF(ISERROR(('A4-FinPerf RE'!G29-'A7-CFlow'!G35)/('A4-FinPerf RE'!G22-'A4-FinPerf RE'!G19)),0,(('A4-FinPerf RE'!G29-'A7-CFlow'!G35)/('A4-FinPerf RE'!G22-'A4-FinPerf RE'!G19)))","v":2.5610554350282113E-2},{"$f":"IF(ISERROR(('A4-FinPerf RE'!H29-'A7-CFlow'!H35)/('A4-FinPerf RE'!H22-'A4-FinPerf RE'!H19)),0,(('A4-FinPerf RE'!H29-'A7-CFlow'!H35)/('A4-FinPerf RE'!H22-'A4-FinPerf RE'!H19)))","v":2.5476079268255757E-2},{"$f":"IF(ISERROR(('A4-FinPerf RE'!I29-'A7-CFlow'!I35)/('A4-FinPerf RE'!I22-'A4-FinPerf RE'!I19)),0,(('A4-FinPerf RE'!I29-'A7-CFlow'!I35)/('A4-FinPerf RE'!I22-'A4-FinPerf RE'!I19)))","v":0},{"$f":"IF(ISERROR(('A4-FinPerf RE'!J29-'A7-CFlow'!J35)/('A4-FinPerf RE'!J22-'A4-FinPerf RE'!J19)),0,(('A4-FinPerf RE'!J29-'A7-CFlow'!J35)/('A4-FinPerf RE'!J22-'A4-FinPerf RE'!J19)))","v":2.7493715389165934E-2},{"$f":"IF(ISERROR(('A4-FinPerf RE'!K29-'A7-CFlow'!K35)/('A4-FinPerf RE'!K22-'A4-FinPerf RE'!K19)),0,(('A4-FinPerf RE'!K29-'A7-CFlow'!K35)/('A4-FinPerf RE'!K22-'A4-FinPerf RE'!K19)))","v":2.7516846199767974E-2},{"$f":"IF(ISERROR(('A4-FinPerf RE'!L29-'A7-CFlow'!L35)/('A4-FinPerf RE'!L22-'A4-FinPerf RE'!L19)),0,(('A4-FinPerf RE'!L29-'A7-CFlow'!L35)/('A4-FinPerf RE'!L22-'A4-FinPerf RE'!L19)))","v":2.7522773564566418E-2}]
["Borrowed funding of 'own' capital expenditure","Borrowing/Capital expenditure excl. transfers and grants and contributions",{"$f":"IF(ISERROR(C49/C48),0,(C49/C48))","v":0},{"$f":"IF(ISERROR(D49/D48),0,(D49/D48))","v":0},{"$f":"IF(ISERROR(E49/E48),0,(E49/E48))","v":0},0,0,0,0,0,0,0]
["Safety of Capital"]
["Gearing","Long Term Borrowing/ Funds & Reserves",{"$f":"IF(ISERROR(('A6-FinPos'!C37/'A6-FinPos'!C46)),0,(('A6-FinPos'!C37/'A6-FinPos'!C46)))","v":0},{"$f":"IF(ISERROR(('A6-FinPos'!D37/'A6-FinPos'!D46)),0,(('A6-FinPos'!D37/'A6-FinPos'!D46)))","v":0},{"$f":"IF(ISERROR(('A6-FinPos'!E37/'A6-FinPos'!E46)),0,(('A6-FinPos'!E37/'A6-FinPos'!E46)))","v":0},{"$f":"IF(ISERROR(('A6-FinPos'!F37/'A6-FinPos'!F46)),0,(('A6-FinPos'!F37/'A6-FinPos'!F46)))","v":0},{"$f":"IF(ISERROR(('A6-FinPos'!G37/'A6-FinPos'!G46)),0,(('A6-FinPos'!G37/'A6-FinPos'!G46)))","v":0},{"$f":"IF(ISERROR(('A6-FinPos'!H37/'A6-FinPos'!H46)),0,(('A6-FinPos'!H37/'A6-FinPos'!H46)))","v":0},{"$f":"IF(ISERROR(('A6-FinPos'!I37/'A6-FinPos'!I46)),0,(('A6-FinPos'!I37/'A6-FinPos'!I46)))","v":0},{"$f":"IF(ISERROR(('A6-FinPos'!J37/'A6-FinPos'!J46)),0,(('A6-FinPos'!J37/'A6-FinPos'!J46)))","v":0},{"$f":"IF(ISERROR(('A6-FinPos'!K37/'A6-FinPos'!K46)),0,(('A6-FinPos'!K37/'A6-FinPos'!K46)))","v":0},{"$f":"IF(ISERROR(('A6-FinPos'!L37/'A6-FinPos'!L46)),0,(('A6-FinPos'!L37/'A6-FinPos'!L46)))","v":0}]
["Liquidity"]
["Current Ratio","Current assets/current liabilities",{"$f":"IF(ISERROR('A6-FinPos'!C12/'A6-FinPos'!C34),0,('A6-FinPos'!C12/'A6-FinPos'!C34))","v":0.20020846305412501},{"$f":"IF(ISERROR('A6-FinPos'!D12/'A6-FinPos'!D34),0,('A6-FinPos'!D12/'A6-FinPos'!D34))","v":0.25862121674194688},{"$f":"IF(ISERROR('A6-FinPos'!E12/'A6-FinPos'!E34),0,('A6-FinPos'!E12/'A6-FinPos'!E34))","v":0.38365976345095865},{"$f":"IF(ISERROR('A6-FinPos'!F12/'A6-FinPos'!F34),0,('A6-FinPos'!F12/'A6-FinPos'!F34))","v":1.2651523352769858},{"$f":"IF(ISERROR('A6-FinPos'!G12/'A6-FinPos'!G34),0,('A6-FinPos'!G12/'A6-FinPos'!G34))","v":1.231464046467899},{"$f":"IF(ISERROR('A6-FinPos'!H12/'A6-FinPos'!H34),0,('A6-FinPos'!H12/'A6-FinPos'!H34))","v":1.231464046467899},{"$f":"IF(ISERROR('A6-FinPos'!I12/'A6-FinPos'!I34),0,('A6-FinPos'!I12/'A6-FinPos'!I34))","v":-1.0678303246745124},{"$f":"IF(ISERROR('A6-FinPos'!J12/'A6-FinPos'!J34),0,('A6-FinPos'!J12/'A6-FinPos'!J34))","v":1.2530059920910237},{"$f":"IF(ISERROR('A6-FinPos'!K12/'A6-FinPos'!K34),0,('A6-FinPos'!K12/'A6-FinPos'!K34))","v":1.2530059920910237},{"$f":"IF(ISERROR('A6-FinPos'!L12/'A6-FinPos'!L34),0,('A6-FinPos'!L12/'A6-FinPos'!L34))","v":1.2530059920910237}]
["Current Ratio adjusted for aged debtors","Current assets less debtors > 90 days/current liabilities",{"$f":"IF(ISERROR(('A6-FinPos'!C12-'SA8'!C45)/'A6-FinPos'!C34),0,(('A6-FinPos'!C12-'SA8'!C45)/'A6-FinPos'!C34))","v":0.20020846305412501},{"$f":"IF(ISERROR(('A6-FinPos'!D12-'SA8'!D45)/'A6-FinPos'!D34),0,(('A6-FinPos'!D12-'SA8'!D45)/'A6-FinPos'!D34))","v":0.25862121674194688},{"$f":"IF(ISERROR(('A6-FinPos'!E12-'SA8'!E45)/'A6-FinPos'!E34),0,(('A6-FinPos'!E12-'SA8'!E45)/'A6-FinPos'!E34))","v":0.38365976345095865},{"$f":"IF(ISERROR(('A6-FinPos'!F12-'SA8'!F45)/'A6-FinPos'!F34),0,(('A6-FinPos'!F12-'SA8'!F45)/'A6-FinPos'!F34))","v":1.2651523352769858},{"$f":"IF(ISERROR(('A6-FinPos'!G12-'SA8'!G45)/'A6-FinPos'!G34),0,(('A6-FinPos'!G12-'SA8'!G45)/'A6-FinPos'!G34))","v":1.231464046467899},{"$f":"IF(ISERROR(('A6-FinPos'!H12-'SA8'!H45)/'A6-FinPos'!H34),0,(('A6-FinPos'!H12-'SA8'!H45)/'A6-FinPos'!H34))","v":1.231464046467899},{"$f":"IF(ISERROR(('A6-FinPos'!I12-'SA8'!I45)/'A6-FinPos'!I34),0,(('A6-FinPos'!I12-'SA8'!I45)/'A6-FinPos'!I34))","v":-1.0678303246745124},{"$f":"IF(ISERROR(('A6-FinPos'!J12-'SA8'!J45)/'A6-FinPos'!J34),0,(('A6-FinPos'!J12-'SA8'!J45)/'A6-FinPos'!J34))","v":1.2530059920910237},{"$f":"IF(ISERROR(('A6-FinPos'!K12-'SA8'!K45)/'A6-FinPos'!K34),0,(('A6-FinPos'!K12-'SA8'!K45)/'A6-FinPos'!K34))","v":1.2530059920910237},{"$f":"IF(ISERROR(('A6-FinPos'!L12-'SA8'!L45)/'A6-FinPos'!L34),0,(('A6-FinPos'!L12-'SA8'!L45)/'A6-FinPos'!L34))","v":1.2530059920910237}]
["Liquidity Ratio","Monetary Assets/Current Liabilities",{"$f":"IF(ISERROR(('A6-FinPos'!C6+'A6-FinPos'!C7)/'A6-FinPos'!C34),0,(('A6-FinPos'!C6+'A6-FinPos'!C7)/'A6-FinPos'!C34))","v":4.3833631712034008E-4},{"$f":"IF(ISERROR(('A6-FinPos'!D6+'A6-FinPos'!D7)/'A6-FinPos'!D34),0,(('A6-FinPos'!D6+'A6-FinPos'!D7)/'A6-FinPos'!D34))","v":2.0999267917761149E-3},{"$f":"IF(ISERROR(('A6-FinPos'!E6+'A6-FinPos'!E7)/'A6-FinPos'!E34),0,(('A6-FinPos'!E6+'A6-FinPos'!E7)/'A6-FinPos'!E34))","v":1.6876593488143622E-3},{"$f":"IF(ISERROR(('A6-FinPos'!F6+'A6-FinPos'!F7)/'A6-FinPos'!F34),0,(('A6-FinPos'!F6+'A6-FinPos'!F7)/'A6-FinPos'!F34))","v":1.0272657897117357E-2},{"$f":"IF(ISERROR(('A6-FinPos'!G6+'A6-FinPos'!G7)/'A6-FinPos'!G34),0,(('A6-FinPos'!G6+'A6-FinPos'!G7)/'A6-FinPos'!G34))","v":1.0272657897117357E-2},{"$f":"IF(ISERROR(('A6-FinPos'!H6+'A6-FinPos'!H7)/'A6-FinPos'!H34),0,(('A6-FinPos'!H6+'A6-FinPos'!H7)/'A6-FinPos'!H34))","v":1.0272657897117357E-2},{"$f":"IF(ISERROR(('A6-FinPos'!I6+'A6-FinPos'!I7)/'A6-FinPos'!I34),0,(('A6-FinPos'!I6+'A6-FinPos'!I7)/'A6-FinPos'!I34))","v":-0.4206506260874403},{"$f":"IF(ISERROR(('A6-FinPos'!J6+'A6-FinPos'!J7)/'A6-FinPos'!J34),0,(('A6-FinPos'!J6+'A6-FinPos'!J7)/'A6-FinPos'!J34))","v":1.0272657897117357E-2},{"$f":"IF(ISERROR(('A6-FinPos'!K6+'A6-FinPos'!K7)/'A6-FinPos'!K34),0,(('A6-FinPos'!K6+'A6-FinPos'!K7)/'A6-FinPos'!K34))","v":1.0272657897117357E-2},{"$f":"IF(ISERROR(('A6-FinPos'!L6+'A6-FinPos'!L7)/'A6-FinPos'!L34),0,(('A6-FinPos'!L6+'A6-FinPos'!L7)/'A6-FinPos'!L34))","v":1.0272657897117357E-2}]
["Revenue Management"]
["Annual Debtors Collection Rate (Payment Level %)","Last 12 Mths Receipts/Last 12 Mths Billing",null,{"$f":"IF(ISERROR(('A7-CFlow'!C6+'A7-CFlow'!C7+'A7-CFlow'!C22+'A7-CFlow'!C23)/SUM('A4-FinPerf RE'!C5:C11)),0,('A7-CFlow'!C6+'A7-CFlow'!C7+'A7-CFlow'!C22+'A7-CFlow'!C23)/(SUM('A4-FinPerf RE'!C5:C11)))","v":0.30955938647925657},{"$f":"IF(ISERROR(('A7-CFlow'!D6+'A7-CFlow'!D7+'A7-CFlow'!D22+'A7-CFlow'!D23)/SUM('A4-FinPerf RE'!D5:D11)),0,('A7-CFlow'!D6+'A7-CFlow'!D7+'A7-CFlow'!D22+'A7-CFlow'!D23)/(SUM('A4-FinPerf RE'!D5:D11)))","v":0.33531516714808901},{"$f":"IF(ISERROR(('A7-CFlow'!E6+'A7-CFlow'!E7+'A7-CFlow'!E22+'A7-CFlow'!E23)/SUM('A4-FinPerf RE'!E5:E11)),0,('A7-CFlow'!E6+'A7-CFlow'!E7+'A7-CFlow'!E22+'A7-CFlow'!E23)/(SUM('A4-FinPerf RE'!E5:E11)))","v":1},{"$f":"IF(ISERROR(('A7-CFlow'!F6+'A7-CFlow'!F7+'A7-CFlow'!F22+'A7-CFlow'!F23)/SUM('A4-FinPerf RE'!F5:F11)),0,('A7-CFlow'!F6+'A7-CFlow'!F7+'A7-CFlow'!F22+'A7-CFlow'!F23)/(SUM('A4-FinPerf RE'!F5:F11)))","v":0.63450233076769169},{"$f":"IF(ISERROR(('A7-CFlow'!G6+'A7-CFlow'!G7+'A7-CFlow'!G22+'A7-CFlow'!G23)/SUM('A4-FinPerf RE'!G5:G11)),0,('A7-CFlow'!G6+'A7-CFlow'!G7+'A7-CFlow'!G22+'A7-CFlow'!G23)/(SUM('A4-FinPerf RE'!G5:G11)))","v":1},{"$f":"IF(ISERROR(('A7-CFlow'!H6+'A7-CFlow'!H7+'A7-CFlow'!H22+'A7-CFlow'!H23)/SUM('A4-FinPerf RE'!H5:H11)),0,('A7-CFlow'!H6+'A7-CFlow'!H7+'A7-CFlow'!H22+'A7-CFlow'!H23)/(SUM('A4-FinPerf RE'!H5:H11)))","v":1},{"$f":"IF(ISERROR(('A7-CFlow'!I6+'A7-CFlow'!I7+'A7-CFlow'!I22+'A7-CFlow'!I23)/SUM('A4-FinPerf RE'!I5:I11)),0,('A7-CFlow'!I6+'A7-CFlow'!I7+'A7-CFlow'!I22+'A7-CFlow'!I23)/(SUM('A4-FinPerf RE'!I5:I11)))","v":0},{"$f":"IF(ISERROR(('A7-CFlow'!J6+'A7-CFlow'!J7+'A7-CFlow'!J22+'A7-CFlow'!J23)/SUM('A4-FinPerf RE'!J5:J11)),0,('A7-CFlow'!J6+'A7-CFlow'!J7+'A7-CFlow'!J22+'A7-CFlow'!J23)/(SUM('A4-FinPerf RE'!J5:J11)))","v":0.49296982478452162},{"$f":"IF(ISERROR(('A7-CFlow'!K6+'A7-CFlow'!K7+'A7-CFlow'!K22+'A7-CFlow'!K23)/SUM('A4-FinPerf RE'!K5:K11)),0,('A7-CFlow'!K6+'A7-CFlow'!K7+'A7-CFlow'!K22+'A7-CFlow'!K23)/(SUM('A4-FinPerf RE'!K5:K11)))","v":0.49296982478452167}]
["Current Debtors Collection Rate (Cash receipts % of Ratepayer & Other revenue)",null,{"$f":"IF(ISERROR(('A7-CFlow'!C6+'A7-CFlow'!C7)/SUM('A4-FinPerf RE'!C5:C11)),0,(('A7-CFlow'!C6+'A7-CFlow'!C7)/SUM('A4-FinPerf RE'!C5:C11)))","v":0.30955938647925657},{"$f":"IF(ISERROR(('A7-CFlow'!D6+'A7-CFlow'!D7)/SUM('A4-FinPerf RE'!D5:D11)),0,(('A7-CFlow'!D6+'A7-CFlow'!D7)/SUM('A4-FinPerf RE'!D5:D11)))","v":0.33531516714808901},{"$f":"IF(ISERROR(('A7-CFlow'!E6+'A7-CFlow'!E7)/SUM('A4-FinPerf RE'!E5:E11)),0,(('A7-CFlow'!E6+'A7-CFlow'!E7)/SUM('A4-FinPerf RE'!E5:E11)))","v":1},{"$f":"IF(ISERROR(('A7-CFlow'!F6+'A7-CFlow'!F7)/SUM('A4-FinPerf RE'!F5:F11)),0,(('A7-CFlow'!F6+'A7-CFlow'!F7)/SUM('A4-FinPerf RE'!F5:F11)))","v":0.63450233076769169},{"$f":"IF(ISERROR(('A7-CFlow'!G6+'A7-CFlow'!G7)/SUM('A4-FinPerf RE'!G5:G11)),0,(('A7-CFlow'!G6+'A7-CFlow'!G7)/SUM('A4-FinPerf RE'!G5:G11)))","v":1},{"$f":"IF(ISERROR(('A7-CFlow'!H6+'A7-CFlow'!H7)/SUM('A4-FinPerf RE'!H5:H11)),0,(('A7-CFlow'!H6+'A7-CFlow'!H7)/SUM('A4-FinPerf RE'!H5:H11)))","v":1},{"$f":"IF(ISERROR(('A7-CFlow'!I6+'A7-CFlow'!I7)/SUM('A4-FinPerf RE'!I5:I11)),0,(('A7-CFlow'!I6+'A7-CFlow'!I7)/SUM('A4-FinPerf RE'!I5:I11)))","v":0},{"$f":"IF(ISERROR(('A7-CFlow'!J6+'A7-CFlow'!J7)/SUM('A4-FinPerf RE'!J5:J11)),0,(('A7-CFlow'!J6+'A7-CFlow'!J7)/SUM('A4-FinPerf RE'!J5:J11)))","v":0.49296982478452162},{"$f":"IF(ISERROR(('A7-CFlow'!K6+'A7-CFlow'!K7)/SUM('A4-FinPerf RE'!K5:K11)),0,(('A7-CFlow'!K6+'A7-CFlow'!K7)/SUM('A4-FinPerf RE'!K5:K11)))","v":0.49296982478452167},{"$f":"IF(ISERROR(('A7-CFlow'!L6+'A7-CFlow'!L7)/SUM('A4-FinPerf RE'!L5:L11)),0,(('A7-CFlow'!L6+'A7-CFlow'!L7)/SUM('A4-FinPerf RE'!L5:L11)))","v":0.49296982478452134}]
["Outstanding Debtors to Revenue","Total Outstanding Debtors to Annual Revenue",{"$f":"IF(ISERROR(('A6-FinPos'!C8+'A6-FinPos'!C9+'A6-FinPos'!C10+'A6-FinPos'!C15)/'A4-FinPerf RE'!C22),0,(('A6-FinPos'!C8+'A6-FinPos'!C9+'A6-FinPos'!C10+'A6-FinPos'!C15)/'A4-FinPerf RE'!C22))","v":0.27435548807789267},{"$f":"IF(ISERROR(('A6-FinPos'!D8+'A6-FinPos'!D9+'A6-FinPos'!D10+'A6-FinPos'!D15)/'A4-FinPerf RE'!D22),0,(('A6-FinPos'!D8+'A6-FinPos'!D9+'A6-FinPos'!D10+'A6-FinPos'!D15)/'A4-FinPerf RE'!D22))","v":0.39468067038330074},{"$f":"IF(ISERROR(('A6-FinPos'!E8+'A6-FinPos'!E9+'A6-FinPos'!E10+'A6-FinPos'!E15)/'A4-FinPerf RE'!E22),0,(('A6-FinPos'!E8+'A6-FinPos'!E9+'A6-FinPos'!E10+'A6-FinPos'!E15)/'A4-FinPerf RE'!E22))","v":0.6989339288490577},{"$f":"IF(ISERROR(('A6-FinPos'!F8+'A6-FinPos'!F9+'A6-FinPos'!F10+'A6-FinPos'!F15)/'A4-FinPerf RE'!F22),0,(('A6-FinPos'!F8+'A6-FinPos'!F9+'A6-FinPos'!F10+'A6-FinPos'!F15)/'A4-FinPerf RE'!F22))","v":0.38448028549499291},{"$f":"IF(ISERROR(('A6-FinPos'!G8+'A6-FinPos'!G9+'A6-FinPos'!G10+'A6-FinPos'!G15)/'A4-FinPerf RE'!G22),0,(('A6-FinPos'!G8+'A6-FinPos'!G9+'A6-FinPos'!G10+'A6-FinPos'!G15)/'A4-FinPerf RE'!G22))","v":0.36405614736210795},{"$f":"IF(ISERROR(('A6-FinPos'!H8+'A6-FinPos'!H9+'A6-FinPos'!H10+'A6-FinPos'!H15)/'A4-FinPerf RE'!H22),0,(('A6-FinPos'!H8+'A6-FinPos'!H9+'A6-FinPos'!H10+'A6-FinPos'!H15)/'A4-FinPerf RE'!H22))","v":0.3740968701454469},{"$f":"IF(ISERROR(('A6-FinPos'!I8+'A6-FinPos'!I9+'A6-FinPos'!I10+'A6-FinPos'!I15)/'A4-FinPerf RE'!I22),0,(('A6-FinPos'!I8+'A6-FinPos'!I9+'A6-FinPos'!I10+'A6-FinPos'!I15)/'A4-FinPerf RE'!I22))","v":0},{"$f":"IF(ISERROR(('A6-FinPos'!J8+'A6-FinPos'!J9+'A6-FinPos'!J10+'A6-FinPos'!J15)/'A4-FinPerf RE'!J22),0,(('A6-FinPos'!J8+'A6-FinPos'!J9+'A6-FinPos'!J10+'A6-FinPos'!J15)/'A4-FinPerf RE'!J22))","v":0.3669856844813959},{"$f":"IF(ISERROR(('A6-FinPos'!K8+'A6-FinPos'!K9+'A6-FinPos'!K10+'A6-FinPos'!K15)/'A4-FinPerf RE'!K22),0,(('A6-FinPos'!K8+'A6-FinPos'!K9+'A6-FinPos'!K10+'A6-FinPos'!K15)/'A4-FinPerf RE'!K22))","v":0.34301458908225896},{"$f":"IF(ISERROR(('A6-FinPos'!L8+'A6-FinPos'!L9+'A6-FinPos'!L10+'A6-FinPos'!L15)/'A4-FinPerf RE'!L22),0,(('A6-FinPos'!L8+'A6-FinPos'!L9+'A6-FinPos'!L10+'A6-FinPos'!L15)/'A4-FinPerf RE'!L22))","v":0.32408728104694573}]
["Longstanding Debtors Recovered","Debtors > 12 Mths Recovered/Total Debtors > 12 Months Old"]
["Creditors Management"]
["Creditors System Efficiency","% of Creditors Paid Within Terms (within`MFMA' s 65(e))"]
["Creditors to Cash and Investments",null,{"$f":"IF(ISERROR('SA3'!C35/'A7-CFlow'!C40), 0, ('SA3'!C35/'A7-CFlow'!C40))","v":60.490804060322816},{"$f":"IF(ISERROR('SA3'!D35/'A7-CFlow'!D40), 0, ('SA3'!D35/'A7-CFlow'!D40))","v":145.86183775147012},{"$f":"IF(ISERROR('SA3'!E35/'A7-CFlow'!E40), 0, ('SA3'!E35/'A7-CFlow'!E40))","v":1956.5431752551526},{"$f":"IF(ISERROR('SA3'!F35/'A7-CFlow'!F40), 0, ('SA3'!F35/'A7-CFlow'!F40))","v":-1.9883648898989048},{"$f":"IF(ISERROR('SA3'!G35/'A7-CFlow'!G40), 0, ('SA3'!G35/'A7-CFlow'!G40))","v":291.40704616452621},{"$f":"IF(ISERROR('SA3'!H35/'A7-CFlow'!H40), 0, ('SA3'!H35/'A7-CFlow'!H40))","v":291.40704616452621},{"$f":"IF(ISERROR('SA3'!I35/'A7-CFlow'!I40), 0, ('SA3'!I35/'A7-CFlow'!I40))","v":-44.255205972259766},{"$f":"IF(ISERROR('SA3'!J35/'A7-CFlow'!J40), 0, ('SA3'!J35/'A7-CFlow'!J40))","v":-9.1504167667324126},{"$f":"IF(ISERROR('SA3'!K35/'A7-CFlow'!K40), 0, ('SA3'!K35/'A7-CFlow'!K40))","v":-5.7448995669710143},{"$f":"IF(ISERROR('SA3'!L35/'A7-CFlow'!L40), 0, ('SA3'!L35/'A7-CFlow'!L40))","v":-3.9488365929134468}]
[]
["Other Indicators"]
["Electricity Distribution Losses (2)","Total Volume Losses (kW)"]
[null,"Total Cost of Losses (Rand '000)"]
[null,"% Volume (units purchased and generated less units sold)/units purchased and generated"]
["Water Distribution Losses (2)","Total Volume Losses (kℓ)"]
[null,"Total Cost of Losses (Rand '000)"]
[null,"% Volume (units purchased and generated less units sold)/units purchased and generated"]
["Employee costs","Employee costs/(Total Revenue - capital revenue)",{"$f":"IF(ISERROR('A4-FinPerf RE'!C25/'A4-FinPerf RE'!C22),0,('A4-FinPerf RE'!C25/'A4-FinPerf RE'!C22))","v":0.49419358077652764},{"$f":"IF(ISERROR('A4-FinPerf RE'!D25/'A4-FinPerf RE'!D22),0,('A4-FinPerf RE'!D25/'A4-FinPerf RE'!D22))","v":0.38436658669195606},{"$f":"IF(ISERROR('A4-FinPerf RE'!E25/'A4-FinPerf RE'!E22),0,('A4-FinPerf RE'!E25/'A4-FinPerf RE'!E22))","v":0.37578808606615843},{"$f":"IF(ISERROR('A4-FinPerf RE'!F25/'A4-FinPerf RE'!F22),0,('A4-FinPerf RE'!F25/'A4-FinPerf RE'!F22))","v":0.44705317437096465},{"$f":"IF(ISERROR('A4-FinPerf RE'!G25/'A4-FinPerf RE'!G22),0,('A4-FinPerf RE'!G25/'A4-FinPerf RE'!G22))","v":0.44099915029547843},{"$f":"IF(ISERROR('A4-FinPerf RE'!H25/'A4-FinPerf RE'!H22),0,('A4-FinPerf RE'!H25/'A4-FinPerf RE'!H22))","v":0.44705317437096465},{"$f":"IF(ISERROR('A4-FinPerf RE'!I25/'A4-FinPerf RE'!I22),0,('A4-FinPerf RE'!I25/'A4-FinPerf RE'!I22))","v":0},{"$f":"IF(ISERROR('A4-FinPerf RE'!J25/'A4-FinPerf RE'!J22),0,('A4-FinPerf RE'!J25/'A4-FinPerf RE'!J22))","v":0.42234477470542453},{"$f":"IF(ISERROR('A4-FinPerf RE'!K25/'A4-FinPerf RE'!K22),0,('A4-FinPerf RE'!K25/'A4-FinPerf RE'!K22))","v":0.39870526915404608},{"$f":"IF(ISERROR('A4-FinPerf RE'!L25/'A4-FinPerf RE'!L22),0,('A4-FinPerf RE'!L25/'A4-FinPerf RE'!L22))","v":0.38047203944352131}]
["Remuneration","Total remuneration/(Total Revenue - capital revenue)",{"$f":"IF(ISERROR('SA22'!C102/'A4-FinPerf RE'!C22),0,('SA22'!C102/'A4-FinPerf RE'!C22))","v":0.47446946043249721},{"$f":"IF(ISERROR('SA22'!D102/'A4-FinPerf RE'!D22),0,('SA22'!D102/'A4-FinPerf RE'!D22))","v":0},{"$f":"IF(ISERROR('SA22'!E102/'A4-FinPerf RE'!E22),0,('SA22'!E102/'A4-FinPerf RE'!E22))","v":0},{"$f":"IF(ISERROR('SA22'!F102/'A4-FinPerf RE'!F22),0,('SA22'!F102/'A4-FinPerf RE'!F22))","v":0.47731991094768411},{"$f":"IF(ISERROR('SA22'!G102/'A4-FinPerf RE'!G22),0,('SA22'!G102/'A4-FinPerf RE'!G22))","v":0.47045235923441103},{"$f":"IF(ISERROR('SA22'!H102/'A4-FinPerf RE'!H22),0,('SA22'!H102/'A4-FinPerf RE'!H22))","v":0},null,{"$f":"IF(ISERROR('SA22'!I102/'A4-FinPerf RE'!J22),0,('SA22'!I102/'A4-FinPerf RE'!J22))","v":0.45181012402011228},{"$f":"IF(ISERROR('SA22'!J102/'A4-FinPerf RE'!K22),0,('SA22'!J102/'A4-FinPerf RE'!K22))","v":0.42652138178700016},{"$f":"IF(ISERROR('SA22'!K102/'A4-FinPerf RE'!L22),0,('SA22'!K102/'A4-FinPerf RE'!L22))","v":0.40701609058722155}]
["Repairs & Maintenance","R&M/(Total Revenue excluding capital revenue)",{"$f":"IF(ISERROR('A9-Asset'!C69/'A4-FinPerf RE'!C22),0,('A9-Asset'!C69/'A4-FinPerf RE'!C22))","v":7.1038803815132653E-2},{"$f":"IF(ISERROR('A9-Asset'!D69/'A4-FinPerf RE'!D22),0,('A9-Asset'!D69/'A4-FinPerf RE'!D22))","v":0.17236775234362686},{"$f":"IF(ISERROR('A9-Asset'!E69/'A4-FinPerf RE'!E22),0,('A9-Asset'!E69/'A4-FinPerf RE'!E22))","v":0},{"$f":"IF(ISERROR('A9-Asset'!F69/'A4-FinPerf RE'!F22),0,('A9-Asset'!F69/'A4-FinPerf RE'!F22))","v":7.0916734937750275E-2},{"$f":"IF(ISERROR('A9-Asset'!G69/'A4-FinPerf RE'!G22),0,('A9-Asset'!G69/'A4-FinPerf RE'!G22))","v":6.9013336826099059E-2},{"$f":"IF(ISERROR('A9-Asset'!H69/'A4-FinPerf RE'!H22),0,('A9-Asset'!H69/'A4-FinPerf RE'!H22))","v":7.0916734937750275E-2},null,{"$f":"IF(ISERROR('A9-Asset'!I69/'A4-FinPerf RE'!J22),0,('A9-Asset'!I69/'A4-FinPerf RE'!J22))","v":8.9797530288576927E-2},{"$f":"IF(ISERROR('A9-Asset'!J69/'A4-FinPerf RE'!K22),0,('A9-Asset'!J69/'A4-FinPerf RE'!K22))","v":9.5333762135597203E-2},{"$f":"IF(ISERROR('A9-Asset'!K69/'A4-FinPerf RE'!L22),0,('A9-Asset'!K69/'A4-FinPerf RE'!L22))","v":0.10412622131311974}]
["Finance charges & Depreciation","FC&D/(Total Revenue - capital revenue)",{"$f":"IF(ISERROR(('A4-FinPerf RE'!C29+'A4-FinPerf RE'!C28)/'A4-FinPerf RE'!C22),0,(('A4-FinPerf RE'!C29+'A4-FinPerf RE'!C28)/'A4-FinPerf RE'!C22))","v":0.91997488804894323},{"$f":"IF(ISERROR(('A4-FinPerf RE'!D29+'A4-FinPerf RE'!D28)/'A4-FinPerf RE'!D22),0,(('A4-FinPerf RE'!D29+'A4-FinPerf RE'!D28)/'A4-FinPerf RE'!D22))","v":0.25893945117796574},{"$f":"IF(ISERROR(('A4-FinPerf RE'!E29+'A4-FinPerf RE'!E28)/'A4-FinPerf RE'!E22),0,(('A4-FinPerf RE'!E29+'A4-FinPerf RE'!E28)/'A4-FinPerf RE'!E22))","v":0.29014375827218558},{"$f":"IF(ISERROR(('A4-FinPerf RE'!F29+'A4-FinPerf RE'!F28)/'A4-FinPerf RE'!F22),0,(('A4-FinPerf RE'!F29+'A4-FinPerf RE'!F28)/'A4-FinPerf RE'!F22))","v":2.4061769809171314E-2},{"$f":"IF(ISERROR(('A4-FinPerf RE'!G29+'A4-FinPerf RE'!G28)/'A4-FinPerf RE'!G22),0,(('A4-FinPerf RE'!G29+'A4-FinPerf RE'!G28)/'A4-FinPerf RE'!G22))","v":2.3415954300914133E-2},{"$f":"IF(ISERROR(('A4-FinPerf RE'!H29+'A4-FinPerf RE'!H28)/'A4-FinPerf RE'!H22),0,(('A4-FinPerf RE'!H29+'A4-FinPerf RE'!H28)/'A4-FinPerf RE'!H22))","v":2.4061769809171314E-2},{"$f":"IF(ISERROR(('A4-FinPerf RE'!I29+'A4-FinPerf RE'!I28)/'A4-FinPerf RE'!I22),0,(('A4-FinPerf RE'!I29+'A4-FinPerf RE'!I28)/'A4-FinPerf RE'!I22))","v":0},{"$f":"IF(ISERROR(('A4-FinPerf RE'!J29+'A4-FinPerf RE'!J28)/'A4-FinPerf RE'!J22),0,(('A4-FinPerf RE'!J29+'A4-FinPerf RE'!J28)/'A4-FinPerf RE'!J22))","v":0.20458519768362293},{"$f":"IF(ISERROR(('A4-FinPerf RE'!K29+'A4-FinPerf RE'!K28)/'A4-FinPerf RE'!K22),0,(('A4-FinPerf RE'!K29+'A4-FinPerf RE'!K28)/'A4-FinPerf RE'!K22))","v":0.1921476434261131},{"$f":"IF(ISERROR(('A4-FinPerf RE'!L29+'A4-FinPerf RE'!L28)/'A4-FinPerf RE'!L22),0,(('A4-FinPerf RE'!L29+'A4-FinPerf RE'!L28)/'A4-FinPerf RE'!L22))","v":0.18247306421917478}]
["IDP regulation financial viability indicators"]
["i. Debt coverage","(Total Operating Revenue - Operating Grants)/Debt service payments due within financial year)",{"$f":"IF(ISERROR(('A4-FinPerf RE'!C22-'A4-FinPerf RE'!C19)/('A7-CFlow'!D11-'A7-CFlow'!D35)),0,(('A4-FinPerf RE'!C22-'A4-FinPerf RE'!C19)/('A7-CFlow'!D11-'A7-CFlow'!D35)))","v":3.6035144051232746},{"$f":"IF(ISERROR(('A4-FinPerf RE'!D22-'A4-FinPerf RE'!D19)/('A7-CFlow'!E11-'A7-CFlow'!E35)),0,(('A4-FinPerf RE'!D22-'A4-FinPerf RE'!D19)/('A7-CFlow'!E11-'A7-CFlow'!E35)))","v":4.0262475649397063},{"$f":"IF(ISERROR(('A4-FinPerf RE'!E22-'A4-FinPerf RE'!E19)/('A7-CFlow'!F11-'A7-CFlow'!F35)),0,(('A4-FinPerf RE'!E22-'A4-FinPerf RE'!E19)/('A7-CFlow'!F11-'A7-CFlow'!F35)))","v":4.4656589750265736},{"$f":"IF(ISERROR(('A4-FinPerf RE'!F22-'A4-FinPerf RE'!F19)/('A7-CFlow'!G11-'A7-CFlow'!G35)),0,(('A4-FinPerf RE'!F22-'A4-FinPerf RE'!F19)/('A7-CFlow'!G11-'A7-CFlow'!G35)))","v":4.3656609155605297},{"$f":"F37","v":4.3656609155605297},{"$f":"G37","v":4.3656609155605297},{"$f":"IF(ISERROR(('A4-FinPerf RE'!I22-'A4-FinPerf RE'!I19)/('A7-CFlow'!J11-'A7-CFlow'!J35)),0,(('A4-FinPerf RE'!I22-'A4-FinPerf RE'!I19)/('A7-CFlow'!J11-'A7-CFlow'!J35)))","v":0},{"$f":"IF(ISERROR(('A4-FinPerf RE'!J22-'A4-FinPerf RE'!J19)/('A7-CFlow'!K11-'A7-CFlow'!K35)),0,(('A4-FinPerf RE'!J22-'A4-FinPerf RE'!J19)/('A7-CFlow'!K11-'A7-CFlow'!K35)))","v":4.0962082106361946},{"$f":"IF(ISERROR(('A4-FinPerf RE'!K22-'A4-FinPerf RE'!K19)/('A7-CFlow'!L11-'A7-CFlow'!L35)),0,(('A4-FinPerf RE'!K22-'A4-FinPerf RE'!K19)/('A7-CFlow'!L11-'A7-CFlow'!L35)))","v":4.0965960142123015},{"$f":"IF(ISERROR(('A4-FinPerf RE'!L22-'A4-FinPerf RE'!L19)/('A7-CFlow'!L11-'A7-CFlow'!L35)),0,(('A4-FinPerf RE'!L22-'A4-FinPerf RE'!L19)/('A7-CFlow'!L11-'A7-CFlow'!L35)))","v":4.3455523044101732}]
["ii.O/S Service Debtors to Revenue","Total outstanding service debtors/annual revenue received for services",{"$f":"IF(ISERROR(('A6-FinPos'!C8+'A6-FinPos'!C9+'A6-FinPos'!C10)/SUM('A4-FinPerf RE'!C5:C12)),0,(('A6-FinPos'!C8+'A6-FinPos'!C9+'A6-FinPos'!C10)/SUM('A4-FinPerf RE'!C5:C12)))","v":0.62833415603061493},{"$f":"IF(ISERROR(('A6-FinPos'!D8+'A6-FinPos'!D9+'A6-FinPos'!D10)/SUM('A4-FinPerf RE'!D5:D12)),0,(('A6-FinPos'!D8+'A6-FinPos'!D9+'A6-FinPos'!D10)/SUM('A4-FinPerf RE'!D5:D12)))","v":0.90643152309877251},{"$f":"IF(ISERROR(('A6-FinPos'!E8+'A6-FinPos'!E9+'A6-FinPos'!E10)/SUM('A4-FinPerf RE'!E5:E12)),0,(('A6-FinPos'!E8+'A6-FinPos'!E9+'A6-FinPos'!E10)/SUM('A4-FinPerf RE'!E5:E12)))","v":1.6301727382632503},{"$f":"IF(ISERROR(('A6-FinPos'!F8+'A6-FinPos'!F9+'A6-FinPos'!F10)/SUM('A4-FinPerf RE'!F5:F12)),0,(('A6-FinPos'!F8+'A6-FinPos'!F9+'A6-FinPos'!F10)/SUM('A4-FinPerf RE'!F5:F12)))","v":0.92682378167875079},{"$f":"IF(ISERROR(('A6-FinPos'!G8+'A6-FinPos'!G9+'A6-FinPos'!G10)/SUM('A4-FinPerf RE'!G5:G12)),0,(('A6-FinPos'!G8+'A6-FinPos'!G9+'A6-FinPos'!G10)/SUM('A4-FinPerf RE'!G5:G12)))","v":0.90179363931756928},{"$f":"IF(ISERROR(('A6-FinPos'!H8+'A6-FinPos'!H9+'A6-FinPos'!H10)/SUM('A4-FinPerf RE'!H5:H12)),0,(('A6-FinPos'!H8+'A6-FinPos'!H9+'A6-FinPos'!H10)/SUM('A4-FinPerf RE'!H5:H12)))","v":0.90179363931756928},{"$f":"IF(ISERROR(('A6-FinPos'!I8+'A6-FinPos'!I9+'A6-FinPos'!I10)/SUM('A4-FinPerf RE'!I5:I12)),0,(('A6-FinPos'!I8+'A6-FinPos'!I9+'A6-FinPos'!I10)/SUM('A4-FinPerf RE'!I5:I12)))","v":0},{"$f":"IF(ISERROR(('A6-FinPos'!J8+'A6-FinPos'!J9+'A6-FinPos'!J10)/SUM('A4-FinPerf RE'!J5:J12)),0,(('A6-FinPos'!J8+'A6-FinPos'!J9+'A6-FinPos'!J10)/SUM('A4-FinPerf RE'!J5:J12)))","v":0.86503218162383222},{"$f":"IF(ISERROR(('A6-FinPos'!K8+'A6-FinPos'!K9+'A6-FinPos'!K10)/SUM('A4-FinPerf RE'!K5:K12)),0,(('A6-FinPos'!K8+'A6-FinPos'!K9+'A6-FinPos'!K10)/SUM('A4-FinPerf RE'!K5:K12)))","v":0.8152989459225557},{"$f":"IF(ISERROR(('A6-FinPos'!L8+'A6-FinPos'!L9+'A6-FinPos'!L10)/SUM('A4-FinPerf RE'!L5:L12)),0,(('A6-FinPos'!L8+'A6-FinPos'!L9+'A6-FinPos'!L10)/SUM('A4-FinPerf RE'!L5:L12)))","v":0.7684250197196566}]
["iii. Cost coverage","(Available cash + Investments)/monthly fixed operational expenditure",{"$f":"IF(ISERROR('A7-CFlow'!C40/'SA8'!C46),0,('A7-CFlow'!C40/'SA8'!C46))","v":0.25879227582606845},{"$f":"IF(ISERROR('A7-CFlow'!D40/'SA8'!D46),0,('A7-CFlow'!D40/'SA8'!D46))","v":0.1329988173225895},{"$f":"IF(ISERROR('A7-CFlow'!E40/'SA8'!E46),0,('A7-CFlow'!E40/'SA8'!E46))","v":1.2691932306734946E-2},{"$f":"IF(ISERROR('A7-CFlow'!F40/'SA8'!F46),0,('A7-CFlow'!F40/'SA8'!F46))","v":-2.6361235537699153},{"$f":"IF(ISERROR('A7-CFlow'!G40/'SA8'!G46),0,('A7-CFlow'!G40/'SA8'!G46))","v":1.7581126550131321E-2},{"$f":"IF(ISERROR('A7-CFlow'!H40/'SA8'!H46),0,('A7-CFlow'!H40/'SA8'!H46))","v":1.7947108937134214E-2},{"$f":"IF(ISERROR('A7-CFlow'!I40/'SA8'!I46),0,('A7-CFlow'!I40/'SA8'!I46))","v":-19.235600000000002},{"$f":"IF(ISERROR('A7-CFlow'!J40/'SA8'!J46),0,('A7-CFlow'!J40/'SA8'!J46))","v":-0.58968989978154529},{"$f":"IF(ISERROR('A7-CFlow'!K40/'SA8'!K46),0,('A7-CFlow'!K40/'SA8'!K46))","v":-0.89946642464235638},{"$f":"IF(ISERROR('A7-CFlow'!L40/'SA8'!L46),0,('A7-CFlow'!L40/'SA8'!L46))","v":-1.2432749000999221}]
[{"$f":"head27a","v":"References"}]
["1. Consumer debtors > 12 months old are excluded from current assets"]
["2. Only include if services provided by the municipality"]
[]
["Calculation data"]
["Debtors > 90 days"]
["Monthly fixed operational expenditure",null,{"$f":"(('A4-FinPerf RE'!C25+'A4-FinPerf RE'!C26+'A4-FinPerf RE'!C27+'A4-FinPerf RE'!C29+'A4-FinPerf RE'!C30+'A4-FinPerf RE'!C32+'SA1'!C91+'A7-CFlow'!C35)+(('A4-FinPerf RE'!C31+'A4-FinPerf RE'!C34)*'SA8'!C47))/12","v":13835814.799999999},{"$f":"(('A4-FinPerf RE'!D25+'A4-FinPerf RE'!D26+'A4-FinPerf RE'!D27+'A4-FinPerf RE'!D29+'A4-FinPerf RE'!D30+'A4-FinPerf RE'!D32+'SA1'!D91+'A7-CFlow'!D35)+(('A4-FinPerf RE'!D31+'A4-FinPerf RE'!D34)*'SA8'!D47))/12","v":15133698.483333334},{"$f":"(('A4-FinPerf RE'!E25+'A4-FinPerf RE'!E26+'A4-FinPerf RE'!E27+'A4-FinPerf RE'!E29+'A4-FinPerf RE'!E30+'A4-FinPerf RE'!E32+'SA1'!E91+'A7-CFlow'!E35)+(('A4-FinPerf RE'!E31+'A4-FinPerf RE'!E34)*'SA8'!E47))/12","v":15115586.450000001},{"$f":"(('A4-FinPerf RE'!F25+'A4-FinPerf RE'!F26+'A4-FinPerf RE'!F27+'A4-FinPerf RE'!F29+'A4-FinPerf RE'!F30+'A4-FinPerf RE'!F32+'SA1'!F91+'A7-CFlow'!F35)+(('A4-FinPerf RE'!F31+'A4-FinPerf RE'!F34)*'SA8'!F47))/12","v":11211907.331783466},{"$f":"(('A4-FinPerf RE'!G25+'A4-FinPerf RE'!G26+'A4-FinPerf RE'!G27+'A4-FinPerf RE'!G29+'A4-FinPerf RE'!G30+'A4-FinPerf RE'!G32+'SA1'!G91+'A7-CFlow'!G35)+(('A4-FinPerf RE'!G31+'A4-FinPerf RE'!G34)*'SA8'!G47))/12","v":11470823.523450131},{"$f":"(('A4-FinPerf RE'!H25+'A4-FinPerf RE'!H26+'A4-FinPerf RE'!H27+'A4-FinPerf RE'!H29+'A4-FinPerf RE'!H30+'A4-FinPerf RE'!H32+'SA1'!H91+'A7-CFlow'!H35)+(('A4-FinPerf RE'!H31+'A4-FinPerf RE'!H34)*'SA8'!H47))/12","v":11236907.331783466},{"$f":"(('A4-FinPerf RE'!I25+'A4-FinPerf RE'!I26+'A4-FinPerf RE'!I27+'A4-FinPerf RE'!I29+'A4-FinPerf RE'!I30+'A4-FinPerf RE'!I32+'SA1'!I91+'A7-CFlow'!I35)+(('A4-FinPerf RE'!I31+'A4-FinPerf RE'!I34)*'SA8'!I47))/12","v":-12500},{"$f":"(('A4-FinPerf RE'!J25+'A4-FinPerf RE'!J26+'A4-FinPerf RE'!J27+'A4-FinPerf RE'!J29+'A4-FinPerf RE'!J30+'A4-FinPerf RE'!J32+'SA1'!J91+'A7-CFlow'!J35)+(('A4-FinPerf RE'!J31+'A4-FinPerf RE'!J34)*'SA8'!J47))/12","v":10891226.320051854},{"$f":"(('A4-FinPerf RE'!K25+'A4-FinPerf RE'!K26+'A4-FinPerf RE'!K27+'A4-FinPerf RE'!K29+'A4-FinPerf RE'!K30+'A4-FinPerf RE'!K32+'SA1'!K91+'A7-CFlow'!K35)+(('A4-FinPerf RE'!K31+'A4-FinPerf RE'!K34)*'SA8'!K47))/12","v":11372971.470499372},{"$f":"(('A4-FinPerf RE'!L25+'A4-FinPerf RE'!L26+'A4-FinPerf RE'!L27+'A4-FinPerf RE'!L29+'A4-FinPerf RE'!L30+'A4-FinPerf RE'!L32+'SA1'!L91+'A7-CFlow'!L35)+(('A4-FinPerf RE'!L31+'A4-FinPerf RE'!L34)*'SA8'!L47))/12","v":11970299.549648933}]
["Fixed operational expenditure % assumption",null,0.4,{"$f":"$C$47","v":0.4},{"$f":"$C$47","v":0.4},0.4,0.4,0.4,0.4,0.4,0.4,0.4]
["Own capex",null,{"$f":"'A5-Capex'!C40-'A5-Capex'!C70-'A5-Capex'!C71","v":2300232},{"$f":"'A5-Capex'!D40-'A5-Capex'!D70-'A5-Capex'!D71","v":1425967},{"$f":"'A5-Capex'!E40-'A5-Capex'!E70-'A5-Capex'!E71","v":980124},{"$f":"'A5-Capex'!F40-'A5-Capex'!F70-'A5-Capex'!F71","v":9990000},{"$f":"'A5-Capex'!G40-'A5-Capex'!G70-'A5-Capex'!G71","v":10170000},{"$f":"'A5-Capex'!H40-'A5-Capex'!H70-'A5-Capex'!H71","v":-31941635},{"$f":"'A5-Capex'!I40-'A5-Capex'!I70-'A5-Capex'!I71","v":0},{"$f":"'A5-Capex'!J40-'A5-Capex'!J70-'A5-Capex'!J71","v":1999999.9975999966},{"$f":"'A5-Capex'!K40-'A5-Capex'!K70-'A5-Capex'!K71","v":2121999.9951759987},{"$f":"'A5-Capex'!L40-'A5-Capex'!L70-'A5-Capex'!L71","v":2251442}]
["Borrowing",null,{"$f":"'A7-CFlow'!C31+'A7-CFlow'!C32","v":0},{"$f":"'A7-CFlow'!D31+'A7-CFlow'!D32","v":0},{"$f":"'A7-CFlow'!E31+'A7-CFlow'!E32","v":0},{"$f":"'A7-CFlow'!F31+'A7-CFlow'!F32","v":0},{"$f":"'A7-CFlow'!G31+'A7-CFlow'!G32","v":0},{"$f":"'A7-CFlow'!H31+'A7-CFlow'!H32","v":0},{"$f":"'A7-CFlow'!I31+'A7-CFlow'!I32","v":0},{"$f":"'A7-CFlow'!J31+'A7-CFlow'!J32","v":0},{"$f":"'A7-CFlow'!K31+'A7-CFlow'!K32","v":0},{"$f":"'A7-CFlow'!L31+'A7-CFlow'!L32","v":0}]

{"sheet":"SA9","index":27,"n_rows":310,"n_cols":13,"rows_kept":310,"cut":false,"hidden":false,"merged":[[62,0,63,0],[62,7,62,9],[62,10,62,12],[108,0,109,0],[108,7,108,9],[108,10,108,12],[1,5,2,5],[1,10,1,12],[246,7,246,9],[246,10,246,12],[246,0,247,0],[154,0,155,0],[154,7,154,9],[154,10,154,12],[200,0,201,0],[200,7,200,9],[200,10,200,12],[1,0,2,0],[1,1,2,1],[1,2,2,2],[1,3,2,3],[1,4,2,4]]}
[{"$f":"muni&\" - \"&TableA9","v":"FS205 Mafube - Supporting Table SA9 Social, economic and demographic statistics and assumptions"}]
["Description of economic indicator","Ref.","Basis of calculation",{"$f":"Head44","v":"2001 Census"},"2007 Survey",{"$f":"Head45","v":"2011 Census"},{"$f":"head1b","v":"2013/14"},{"$f":"head1A","v":"2014/15"},{"$f":"Head1","v":"2015/16"},{"$f":"Head2","v":"Current Year 2016/17"},{"$f":"Head3","v":"2017/18 Medium Term Revenue & Expenditure Framework"}]
[null,null,null,null,null,null,{"$f":"Head5A","v":"Outcome"},"Outcome","Outcome",{"$f":"Head6","v":"Original Budget"},"Outcome","Outcome","Outcome"]
["Demographics"]
["Population",null,null,57659,53722,57876,73384.395084000003,77053.61483820001,80906.295580110018,84951.610359115526,89199.190877071305,89199.190877071305,89199.190877071305]
["Females aged 5 - 14",null,null,2792.48875,2601.8006600000003,2803,3554.0890770000005,3731.7935308500009,12728.11,13364.51,14032.74,14032.74,14032.74]
["Males aged 5 - 14",null,null,2908.05375,2709.4741800000002,2919,3701.1723210000005,3886.2309370500006,12823.16,13464.32,14137.54,14137.54,14137.54]
["Females aged 15 - 34",null,null,1979.5487499999999,1844.3731400000001,1987,2519.4345330000001,2645.4062596500003,14142.81,14849.95,15592.44,15592.44,15592.44]
["Males aged 15 - 34",null,null,2094.1174999999998,1951.1184400000002,2102,2665.2498180000002,2798.5123089000003,14226.68,14938.01,15684.92,15684.92,15684.92]
["Unemployment",null,null,7628,5496.9188400000003,5922,7508.8531980000007,7884.2958579000015,8278.5106507950022,8692.4361833347521,9127.0579925014899,9127.0579925014899,9127.0579925014899]
[]
["Monthly household income (no. of households)","1, 12"]
["No income",null,"Census 2001, 2007 & 2011 Survey",22289,13373.4,23150,2575.2247290000005,2703.9859654500005,2981.1445269086257,2981.1445269086257,3130.2017532540572,3130.2017532540572,3130.2017532540572]
["R1 - R1 600",null,"Census 2001, 2007 & 2011 Survey",10664,6398.4,25902,1073.9612730000001,1127.6593366500001,1243.2444186566252,1243.2444186566252,1305.4066395894565,1305.4066395894565,1305.4066395894565]
["R1 601 - R3 200",null,"Census 2001, 2007 & 2011 Survey",741,444.59999999999997,2695,1825.8609600000002,1917.1540080000002,2113.6622938200003,2113.6622938200003,2219.3454085110002,2219.3454085110002,2219.3454085110002]
["R3 201 - R6 400",null,"Census 2001, 2007 & 2011 Survey",286,171.6,1605,4865.1586830000006,5108.416617150001,5632.0293204078762,5632.0293204078762,5913.6307864282699,5913.6307864282699,5913.6307864282699]
["R6 401 - R12 800",null,"Census 2001, 2007 & 2011 Survey",44,26.4,1217,5151.7174170000008,5409.3032878500007,5963.7568748546255,5963.7568748546255,6261.9447185973568,6261.9447185973568,6261.9447185973568]
["R12 801 - R25 600",null,"Census 2001, 2007 & 2011 Survey",22,13.2,625,2656.3741050000003,2789.1928102500005,3075.0850733006259,3075.0850733006259,3228.8393269656572,3228.8393269656572,3228.8393269656572]
["R25 601 - R51 200",null,"Census 2001, 2007 & 2011 Survey",21,12.6,194,1397.2908180000002,1467.1553589000002,1617.5387831872504,1617.5387831872504,1698.4157223466129,1698.4157223466129,1698.4157223466129]
["R52 201 - R102 400",null,"Census 2001, 2007 & 2011 Survey",18,10.799999999999999,52,796.27825200000018,836.09216460000027,921.79161147150046,921.79161147150046,967.88119204507552,967.88119204507552,967.88119204507552]
["R102 401 - R204 800",null,"Census 2001, 2007 & 2011 Survey",2,1.2,37,379.11974100000009,398.07572805000012,438.87849017512519,438.87849017512519,460.82241468388145,460.82241468388145,460.82241468388145]
["R204 801 - R409 600",null,"Census 2001, 2007 & 2011 Survey",null,null,12,81.149376000000004,85.206844800000013,93.940546392000016,93.940546392000016,98.637573711600027,98.637573711600027,98.637573711600027]
["R409 601 - R819 200",null,"Census 2001, 2007 & 2011 Survey",null,null,null,49.450401000000006,51.922921050000006,57.24502045762501,57.24502045762501,60.107271480506263,60.107271480506263,60.107271480506263]
[" > R819 200",null,"Census 2001, 2007 & 2011 Survey",null,null,null,21.555303000000002,22.633068150000003,24.952957635375004,24.952957635375004,26.200605517143757,26.200605517143757,26.200605517143757]
[]
[]
["Poverty profiles (no. of households)"]
["< R2 060 per household per month",13]
["Insert description",2]
[]
["Household/demographics (000)"]
["Number of people in municipal area",null,"Census 2001, 2007 & 2011 Survey",57659,53722,57876,60769.8,63808.290000000008,80906.295580110018,84951.610359115526,89199.190877071305,89199.190877071305,89199.190877071305]
["Number of poor people in municipal area",null,"Census 2001, 2007 & 2011 Survey",24609,29717.336220000001,23706,24891.3,26135.865000000002,33139.205249535007,34796.165512011758,36535.973787612347,36535.973787612347,36535.973787612347]
["Number of households in municipal area",null,"Census 2001, 2007 & 2011 Survey",14661,14005,16462,17285.100000000002,18149.355000000003,23012.638016445006,24163.269917267258,25371.43341313062,25371.43341313062,25371.43341313062]
["Number of poor households in municipal area",null,"Census 2001, 2007 & 2011 Survey",22289,26915.750620000003,2031,2132.5500000000002,2239.1775000000002,2839.1852637225006,2981.1445269086257,3130.2017532540572,3130.2017532540572,3130.2017532540572]
["Definition of poor household (R per month)",null,"Indigent policy",1000,1200,1502,1577.1000000000001,1655.9550000000002,2099.6830458450004,2204.6671981372506,2314.900558044113,2314.900558044113,2314.900558044113]
[]
["Housing statistics",3]
["Formal",null,null,9632.2800000000007,9397.36,10361,13137.323199,13794.189358950001,14483.898826897503,15208.093768242379,15968.498456654499,15968.498456654499,15968.498456654499]
["Informal",null,null,5029,4608,5080,6441.2317200000007,6763.2933060000014,7101.4579713000021,7456.5308698650024,7829.3574133582524,7829.3574133582524,7829.3574133582524]
["Total number of households",null,null,{"$f":"SUM(D39:D40)","v":14661.28},{"$f":"SUM(E39:E40)","v":14005.36},15441,19578.554919000002,20557.482664950003,21585.356798197507,22664.62463810738,23797.855870012751,23797.855870012751,23797.855870012751]
["Dwellings provided by municipality",4,null,19690.28,18613.36,20521,26019.786639000002,27320.775970950002,28686.814769497509,30121.155507972384,31627.213283371002,31627.213283371002,31627.213283371002]
["Dwellings provided by province/s",null,null,1205,2500,2756,4018.9355018384008,4853.186133310016,5860.6105108625097,7077.1560407073503,8546.2320916373828,8546.2320916373828,8546.2320916373828]
["Dwellings provided by private sector",5]
["Total new housing dwellings",null,null,{"$f":"SUM(D42:D44)","v":20895.28},{"$f":"SUM(E42:E44)","v":21113.360000000001},23277,30038.722140838403,32173.962104260019,34547.425280360017,37198.311548679732,40173.445375008385,40173.445375008385,40173.445375008385]
[]
["Economic",6]
["Inflation/inflation outlook (CPIX)"]
["Interest rate - borrowing"]
["Interest rate - investment"]
["Remuneration increases"]
["Consumption growth (electricity)"]
["Consumption growth (water)"]
[]
["Collection rates",7]
["Property tax/service charges"]
["Rental of facilities & equipment"]
["Interest - external investments"]
["Interest - debtors"]
["Revenue from agency services"]
[]
["Detail on the provision of municipal services for A10"]
["Total municipal services",null,null,null,{"$f":"head1b","v":"2013/14"},{"$f":"head1A","v":"2014/15"},{"$f":"Head1","v":"2015/16"},{"$f":"Head2","v":"Current Year 2016/17"},null,null,{"$f":"Head3","v":"2017/18 Medium Term Revenue & Expenditure Framework"}]
[null,"Ref.",null,null,{"$f":"Head5A","v":"Outcome"},{"$f":"Head5A","v":"Outcome"},{"$f":"Head5A","v":"Outcome"},{"$f":"Head6","v":"Original Budget"},{"$f":"Head7","v":"Adjusted Budget"},{"$f":"Head8","v":"Full Year Forecast"},{"$f":"Head9","v":"Budget Year 2017/18"},{"$f":"Head10","v":"Budget Year +1 2018/19"},{"$f":"Head11","v":"Budget Year +2 2019/20"}]
[null,null,"Household service targets (000)"]
[null,null,"Water:"]
[null,null,"Piped water inside dwelling",null,{"$f":"E113+E159+E205","v":0},{"$f":"F113+F159+F205","v":0},14000,15000,14000,14000,15000,15000,15000]
[null,null,"Piped water inside yard (but not in dwelling)",null,{"$f":"E114+E160+E206","v":0},0,0,0,0,0,0,0,0]
[null,8,"Using public tap (at least min.service level)",null,0,0,0,0,0,0,0,0,0]
[null,10,"Other water supply (at least min.service level)",null,0,0,0,0,0,0,0,0,0]
[null,null,"Minimum Service Level and Above sub-total",null,{"$f":"SUM(E67:E70)","v":0},{"$f":"SUM(F67:F70)","v":0},14000,15000,14000,14000,15000,15000,15000]
[null,9,"Using public tap (< min.service level)",null,{"$f":"E118+E164+E210","v":0},0,1300,600,1300,1300,600,600,600]
[null,10,"Other water supply (< min.service level)",null,0,0,0,0,0,0,0,0,0]
[null,null,"No water supply",null,0,0,0,0,0,0,0,0,0]
[null,null,"Below Minimum Service Level sub-total",null,{"$f":"SUM(E72:E74)","v":0},{"$f":"SUM(F72:F74)","v":0},1300,600,1300,1300,600,600,600]
[null,null,"Total number of households",null,{"$f":"E71+E75","v":0},{"$f":"F71+F75","v":0},15300,15600,15300,15300,15600,15600,15600]
[null,null,"Sanitation/sewerage:"]
[null,null,"Flush toilet (connected to sewerage)",null,{"$f":"E124+E170+E216","v":0},0,14000,15000,14000,14000,15000,15000,15000]
[null,null,"Flush toilet (with septic tank)",null,{"$f":"E125+E171+E217","v":0},0,0,0,0,0,0,0,0]
[null,null,"Chemical toilet",null,{"$f":"E126+E172+E218","v":0},0,0,0,0,0,0,0,0]
[null,null,"Pit toilet (ventilated)",null,{"$f":"E127+E173+E219","v":0},0,0,0,0,0,0,0,0]
[null,null,"Other toilet provisions (> min.service level)",null,{"$f":"E128+E174+E220","v":0},0,0,0,0,0,0,0,0]
[null,null,"Minimum Service Level and Above sub-total",null,{"$f":"SUM(E78:E82)","v":0},{"$f":"SUM(F78:F82)","v":0},14000,15000,14000,14000,15000,15000,15000]
[null,null,"Bucket toilet",null,{"$f":"E130+E176+E222","v":0},0,0,0,0,0,0,0,0]
[null,null,"Other toilet provisions (< min.service level)",null,{"$f":"E131+E177+E223","v":0},0,0,0,0,0,0,0,0]
[null,null,"No toilet provisions",null,{"$f":"E132+E178+E224","v":0},0,0,0,0,0,0,0,0]
[null,null,"Below Minimum Service Level sub-total",null,{"$f":"SUM(E84:E86)","v":0},{"$f":"SUM(F84:F86)","v":0},0,0,0,0,0,0,0]
[null,null,"Total number of households",null,{"$f":"E83+E87","v":0},{"$f":"F83+F87","v":0},14000,15000,14000,14000,15000,15000,15000]
[null,null,"Energy:"]
[null,null,"Electricity (at least min.service level)",null,{"$f":"E136+E182+E228","v":0},0,0,15500,15000,15000,16000,16000,16000]
[null,null,"Electricity - prepaid (min.service level)",null,{"$f":"E137+E183+E229","v":0},0,0,0,0,0,0,0,0]
[null,null,"Minimum Service Level and Above sub-total",null,{"$f":"SUM(E90:E91)","v":0},{"$f":"SUM(F90:F91)","v":0},0,15500,15000,15000,16000,16000,16000]
[null,null,"Electricity (< min.service level)",null,{"$f":"E139+E185+E231","v":0},0,1430,0,0,0,0,0,0]
[null,null,"Electricity - prepaid (< min. service level)",null,{"$f":"E140+E186+E232","v":0},0,0,0,0,0,0,0,0]
[null,null,"Other energy sources",null,{"$f":"E141+E187+E233","v":0},0,1430,1430,1430,1430,2000,2000,2000]
[null,null,"Below Minimum Service Level sub-total",null,{"$f":"SUM(E93:E95)","v":0},{"$f":"SUM(F93:F95)","v":0},2860,1430,1430,1430,2000,2000,2000]
[null,null,"Total number of households",null,{"$f":"E92+E96","v":0},{"$f":"F92+F96","v":0},2860,16930,16430,16430,18000,18000,18000]
[null,null,"Refuse:"]
[null,null,"Removed at least once a week",null,{"$f":"E145+E191+E237","v":0},0,13500,13500,13500,13500,15500,15500,16000]
[null,null,"Minimum Service Level and Above sub-total",null,{"$f":"SUM(E99)","v":0},{"$f":"SUM(F99)","v":0},13500,13500,13500,13500,15500,15500,16000]
[null,null,"Removed less frequently than once a week",null,{"$f":"E147+E193+E239","v":0},0,0,0,0,0,0,0,0]
[null,null,"Using communal refuse dump",null,{"$f":"E148+E194+E240","v":0},0,0,2000,0,0,0,0,0]
[null,null,"Using own refuse dump",null,{"$f":"E149+E195+E241","v":0},0,4000,4000,4000,4000,4500,4500,5000]
[null,null,"Other rubbish disposal",null,{"$f":"E150+E196+E242","v":0},0,0,0,0,0,0,0,0]
[null,null,"No rubbish disposal",null,{"$f":"E151+E197+E243","v":0},0,0,0,0,0,0,0,0]
[null,null,"Below Minimum Service Level sub-total",null,{"$f":"SUM(E101:E105)","v":0},0,4000,6000,4000,4000,4500,4500,5000]
[null,null,"Total number of households",null,{"$f":"E100+E106","v":0},{"$f":"F100+F106","v":0},17500,19500,17500,17500,20000,20000,21000]
[]
["Municipal in-house services",null,null,null,{"$f":"head1b","v":"2013/14"},{"$f":"head1A","v":"2014/15"},{"$f":"Head1","v":"2015/16"},{"$f":"Head2","v":"Current Year 2016/17"},null,null,{"$f":"Head3","v":"2017/18 Medium Term Revenue & Expenditure Framework"}]
[null,"Ref.",null,null,{"$f":"Head5A","v":"Outcome"},{"$f":"Head5A","v":"Outcome"},{"$f":"Head5A","v":"Outcome"},{"$f":"Head6","v":"Original Budget"},{"$f":"Head7","v":"Adjusted Budget"},{"$f":"Head8","v":"Full Year Forecast"},{"$f":"Head9","v":"Budget Year 2017/18"},{"$f":"Head10","v":"Budget Year +1 2018/19"},{"$f":"Head11","v":"Budget Year +2 2019/20"}]
[null,null,"Household service targets (000)"]
[null,null,"Water:"]
[null,null,"Piped water inside dwelling",null,null,null,14000,15000,14000,14000,15000,15000,15000]
[null,null,"Piped water inside yard (but not in dwelling)"]
[null,8,"Using public tap (at least min.service level)"]
[null,10,"Other water supply (at least min.service level)"]
[null,null,"Minimum Service Level and Above sub-total",null,{"$f":"SUM(E113:E116)","v":0},{"$f":"SUM(F113:F116)","v":0},14000,15000,14000,14000,15000,15000,15000]
[null,9,"Using public tap (< min.service level)",null,null,null,1300,600,1300,1300,600,600,600]
[null,10,"Other water supply (< min.service level)"]
[null,null,"No water supply"]
[null,null,"Below Minimum Service Level sub-total",null,{"$f":"SUM(E118:E120)","v":0},{"$f":"SUM(F118:F120)","v":0},1300,600,1300,1300,600,600,600]
[null,null,"Total number of households",null,{"$f":"E117+E121","v":0},{"$f":"F117+F121","v":0},15300,15600,15300,15300,15600,15600,15600]
[null,null,"Sanitation/sewerage:"]
[null,null,"Flush toilet (connected to sewerage)",null,null,null,14000,15000,14000,14000,15000,15000,15000]
[null,null,"Flush toilet (with septic tank)"]
[null,null,"Chemical toilet"]
[null,null,"Pit toilet (ventilated)"]
[null,null,"Other toilet provisions (> min.service level)"]
[null,null,"Minimum Service Level and Above sub-total",null,{"$f":"SUM(E124:E128)","v":0},{"$f":"SUM(F124:F128)","v":0},14000,15000,14000,14000,15000,15000,15000]
[null,null,"Bucket toilet"]
[null,null,"Other toilet provisions (< min.service level)"]
[null,null,"No toilet provisions"]
[null,null,"Below Minimum Service Level sub-total",null,{"$f":"SUM(E130:E132)","v":0},{"$f":"SUM(F130:F132)","v":0},0,0,0,0,0,0,0]
[null,null,"Total number of households",null,{"$f":"E129+E133","v":0},{"$f":"F129+F133","v":0},14000,15000,14000,14000,15000,15000,15000]
[null,null,"Energy:"]
[null,null,"Electricity (at least min.service level)",null,null,null,null,15500,15000,15000,16000,16000,16000]
[null,null,"Electricity - prepaid (min.service level)"]
[null,null,"Minimum Service Level and Above sub-total",null,{"$f":"SUM(E136:E137)","v":0},{"$f":"SUM(F136:F137)","v":0},0,15500,15000,15000,16000,16000,16000]
[null,null,"Electricity (< min.service level)",null,null,null,1430]
[null,null,"Electricity - prepaid (< min. service level)"]
[null,null,"Other energy sources",null,null,null,1430,1430,1430,1430,2000,2000,2000]
[null,null,"Below Minimum Service Level sub-total",null,{"$f":"SUM(E139:E141)","v":0},{"$f":"SUM(F139:F141)","v":0},2860,1430,1430,1430,2000,2000,2000]
[null,null,"Total number of households",null,{"$f":"E138+E142","v":0},{"$f":"F138+F142","v":0},2860,16930,16430,16430,18000,18000,18000]
[null,null,"Refuse:"]
[null,null,"Removed at least once a week",null,null,null,13500,13500,13500,13500,15500,15500,16000]
[null,null,"Minimum Service Level and Above sub-total",null,{"$f":"SUM(E145)","v":0},{"$f":"SUM(F145)","v":0},13500,13500,13500,13500,15500,15500,16000]
[null,null,"Removed less frequently than once a week"]
[null,null,"Using communal refuse dump",null,null,null,0,2000,0,0,0,0,0]
[null,null,"Using own refuse dump",null,null,null,4000,4000,4000,4000,4500,4500,5000]
[null,null,"Other rubbish disposal"]
[null,null,"No rubbish disposal"]
[null,null,"Below Minimum Service Level sub-total",null,{"$f":"SUM(E147:E151)","v":0},0,4000,6000,4000,4000,4500,4500,5000]
[null,null,"Total number of households",null,{"$f":"E146+E152","v":0},{"$f":"F146+F152","v":0},17500,19500,17500,17500,20000,20000,21000]
[]
["Municipal entity services",null,null,null,{"$f":"head1b","v":"2013/14"},{"$f":"head1A","v":"2014/15"},{"$f":"Head1","v":"2015/16"},{"$f":"Head2","v":"Current Year 2016/17"},null,null,{"$f":"Head3","v":"2017/18 Medium Term Revenue & Expenditure Framework"}]
[null,"Ref.",null,null,{"$f":"Head5A","v":"Outcome"},{"$f":"Head5A","v":"Outcome"},{"$f":"Head5A","v":"Outcome"},{"$f":"Head6","v":"Original Budget"},{"$f":"Head7","v":"Adjusted Budget"},{"$f":"Head8","v":"Full Year Forecast"},{"$f":"Head9","v":"Budget Year 2017/18"},{"$f":"Head10","v":"Budget Year +1 2018/19"},{"$f":"Head11","v":"Budget Year +2 2019/20"}]
[null,null,"Household service targets (000)"]
["Name of municipal entity",null,"Water:"]
[null,null,"Piped water inside dwelling"]
[null,null,"Piped water inside yard (but not in dwelling)"]
[null,8,"Using public tap (at least min.service level)"]
[null,10,"Other water supply (at least min.service level)"]
[null,null,"Minimum Service Level and Above sub-total",null,{"$f":"SUM(E159:E162)","v":0},{"$f":"SUM(F159:F162)","v":0},0,0,0,0,0,0,0]
[null,9,"Using public tap (< min.service level)"]
[null,10,"Other water supply (< min.service level)"]
[null,null,"No water supply"]
[null,null,"Below Minimum Service Level sub-total",null,{"$f":"SUM(E164:E166)","v":0},{"$f":"SUM(F164:F166)","v":0},0,0,0,0,0,0,0]
[null,null,"Total number of households",null,{"$f":"E163+E167","v":0},{"$f":"F163+F167","v":0},0,0,0,0,0,0,0]
["Name of municipal entity",null,"Sanitation/sewerage:"]
[null,null,"Flush toilet (connected to sewerage)"]
[null,null,"Flush toilet (with septic tank)"]
[null,null,"Chemical toilet"]
[null,null,"Pit toilet (ventilated)"]
[null,null,"Other toilet provisions (> min.service level)"]
[null,null,"Minimum Service Level and Above sub-total",null,{"$f":"SUM(E170:E174)","v":0},{"$f":"SUM(F170:F174)","v":0},0,0,0,0,0,0,0]
[null,null,"Bucket toilet"]
[null,null,"Other toilet provisions (< min.service level)"]
[null,null,"No toilet provisions"]
[null,null,"Below Minimum Service Level sub-total",null,{"$f":"SUM(E176:E178)","v":0},{"$f":"SUM(F176:F178)","v":0},0,0,0,0,0,0,0]
[null,null,"Total number of households",null,{"$f":"E175+E179","v":0},{"$f":"F175+F179","v":0},0,0,0,0,0,0,0]
["Name of municipal entity",null,"Energy:"]
[null,null,"Electricity (at least min.service level)"]
[null,null,"Electricity - prepaid (min.service level)"]
[null,null,"Minimum Service Level and Above sub-total",null,{"$f":"SUM(E182:E183)","v":0},{"$f":"SUM(F182:F183)","v":0},0,0,0,0,0,0,0]
[null,null,"Electricity (< min.service level)"]
[null,null,"Electricity - prepaid (< min. service level)"]
[null,null,"Other energy sources"]
[null,null,"Below Minimum Service Level sub-total",null,{"$f":"SUM(E185:E187)","v":0},{"$f":"SUM(F185:F187)","v":0},0,0,0,0,0,0,0]
[null,null,"Total number of households",null,{"$f":"E184+E188","v":0},{"$f":"F184+F188","v":0},0,0,0,0,0,0,0]
["Name of municipal entity",null,"Refuse:"]
[null,null,"Removed at least once a week"]
[null,null,"Minimum Service Level and Above sub-total",null,{"$f":"SUM(E191)","v":0},{"$f":"SUM(F191)","v":0},0,0,0,0,0,0,0]
[null,null,"Removed less frequently than once a week"]
[null,null,"Using communal refuse dump"]
[null,null,"Using own refuse dump"]
[null,null,"Other rubbish disposal"]
[null,null,"No rubbish disposal"]
[null,null,"Below Minimum Service Level sub-total",null,{"$f":"SUM(E193:E197)","v":0},0,0,0,0,0,0,0,0]
[null,null,"Total number of households",null,{"$f":"E192+E198","v":0},{"$f":"F192+F198","v":0},0,0,0,0,0,0,0]
[]
["Services provided by 'external mechanisms'",null,null,null,{"$f":"head1b","v":"2013/14"},{"$f":"head1A","v":"2014/15"},{"$f":"Head1","v":"2015/16"},{"$f":"Head2","v":"Current Year 2016/17"},null,null,{"$f":"Head3","v":"2017/18 Medium Term Revenue & Expenditure Framework"}]
[null,"Ref.",null,null,{"$f":"Head5A","v":"Outcome"},{"$f":"Head5A","v":"Outcome"},{"$f":"Head5A","v":"Outcome"},{"$f":"Head6","v":"Original Budget"},{"$f":"Head7","v":"Adjusted Budget"},{"$f":"Head8","v":"Full Year Forecast"},{"$f":"Head9","v":"Budget Year 2017/18"},{"$f":"Head10","v":"Budget Year +1 2018/19"},{"$f":"Head11","v":"Budget Year +2 2019/20"}]
["Names of service providers",null,"Household service targets (000)"]
[null,null,"Water:"]
[null,null,"Piped water inside dwelling"]
[null,null,"Piped water inside yard (but not in dwelling)"]
[null,8,"Using public tap (at least min.service level)"]
[null,10,"Other water supply (at least min.service level)"]
[null,null,"Minimum Service Level and Above sub-total",null,{"$f":"SUM(E205:E208)","v":0},{"$f":"SUM(F205:F208)","v":0},0,0,0,0,0,0,0]
[null,9,"Using public tap (< min.service level)"]
[null,10,"Other water supply (< min.service level)"]
[null,null,"No water supply"]
[null,null,"Below Minimum Service Level sub-total",null,{"$f":"SUM(E210:E212)","v":0},{"$f":"SUM(F210:F212)","v":0},0,0,0,0,0,0,0]
[null,null,"Total number of households",null,{"$f":"E209+E213","v":0},{"$f":"F209+F213","v":0},0,0,0,0,0,0,0]
["Names of service providers",null,"Sanitation/sewerage:"]
[null,null,"Flush toilet (connected to sewerage)"]
[null,null,"Flush toilet (with septic tank)"]
[null,null,"Chemical toilet"]
[null,null,"Pit toilet (ventilated)"]
[null,null,"Other toilet provisions (> min.service level)"]
[null,null,"Minimum Service Level and Above sub-total",null,{"$f":"SUM(E216:E220)","v":0},{"$f":"SUM(F216:F220)","v":0},0,0,0,0,0,0,0]
[null,null,"Bucket toilet"]
[null,null,"Other toilet provisions (< min.service level)"]
[null,null,"No toilet provisions"]
[null,null,"Below Minimum Service Level sub-total",null,{"$f":"SUM(E222:E224)","v":0},{"$f":"SUM(F222:F224)","v":0},0,0,0,0,0,0,0]
[null,null,"Total number of households",null,{"$f":"E221+E225","v":0},{"$f":"F221+F225","v":0},0,0,0,0,0,0,0]
["Names of service providers",null,"Energy:"]
[null,null,"Electricity (at least min.service level)"]
[null,null,"Electricity - prepaid (min.service level)"]
[null,null,"Minimum Service Level and Above sub-total",null,{"$f":"SUM(E228:E229)","v":0},{"$f":"SUM(F228:F229)","v":0},0,0,0,0,0,0,0]
[null,null,"Electricity (< min.service level)"]
[null,null,"Electricity - prepaid (< min. service level)"]
[null,null,"Other energy sources"]
[null,null,"Below Minimum Service Level sub-total",null,{"$f":"SUM(E231:E233)","v":0},{"$f":"SUM(F231:F233)","v":0},0,0,0,0,0,0,0]
[null,null,"Total number of households",null,{"$f":"E230+E234","v":0},{"$f":"F230+F234","v":0},0,0,0,0,0,0,0]
["Names of service providers",null,"Refuse:"]
[null,null,"Removed at least once a week"]
[null,null,"Minimum Service Level and Above sub-total",null,{"$f":"SUM(E237)","v":0},{"$f":"SUM(F237)","v":0},0,0,0,0,0,0,0]
[null,null,"Removed less frequently than once a week"]
[null,null,"Using communal refuse dump"]
[null,null,"Using own refuse dump"]
[null,null,"Other rubbish disposal"]
[null,null,"No rubbish disposal"]
[null,null,"Below Minimum Service Level sub-total",null,{"$f":"SUM(E239:E243)","v":0},0,0,0,0,0,0,0,0]
[null,null,"Total number of households",null,{"$f":"E238+E244","v":0},{"$f":"F238+F244","v":0},0,0,0,0,0,0,0]
[]
["Detail of Free Basic Services (FBS) provided",null,null,null,{"$f":"head1b","v":"2013/14"},{"$f":"head1A","v":"2014/15"},{"$f":"Head1","v":"2015/16"},{"$f":"Head2","v":"Current Year 2016/17"},null,null,{"$f":"Head3","v":"2017/18 Medium Term Revenue & Expenditure Framework"}]
[null,null,null,null,{"$f":"Head5A","v":"Outcome"},{"$f":"Head5A","v":"Outcome"},{"$f":"Head5A","v":"Outcome"},{"$f":"Head6","v":"Original Budget"},{"$f":"Head7","v":"Adjusted Budget"},{"$f":"Head8","v":"Full Year Forecast"},{"$f":"Head9","v":"Budget Year 2017/18"},{"$f":"Head10","v":"Budget Year +1 2018/19"},{"$f":"Head11","v":"Budget Year +2 2019/20"}]
["Electricity","Ref.","Location of households for each type of FBS"]
["List type of FBS service",null,"Formal settlements -  (50 kwh per indigent household per month R'000)"]
[null,null,"Number of HH receiving this type of FBS"]
[null,null,"Informal settlements (R'000)"]
[null,null,"Number of HH receiving this type of FBS"]
[null,null,"Informal settlements targeted for upgrading (R'000)"]
[null,null,"Number of HH receiving this type of FBS"]
[null,null,"Living in informal backyard rental agreement (R'000)"]
[null,null,"Number of HH receiving this type of FBS"]
[null,null,"Other (R'000)",null,null,null,null,4300,4300,4300,4800,4900,4900]
[null,null,"Number of HH receiving this type of FBS"]
[null,null,"Total cost of FBS - Electricity for informal settlements",null,{"$f":"E252+E254+E256+E258","v":0},{"$f":"F252+F254+F256+F258","v":0},0,4300,4300,4300,4800,4900,4900]
["Water","Ref.","Location of households for each type of FBS"]
["List type of FBS service",null,"Formal settlements -  (6 kilolitre per indigent household per month R'000)"]
[null,null,"Number of HH receiving this type of FBS"]
[null,null,"Informal settlements (R'000)"]
[null,null,"Number of HH receiving this type of FBS"]
[null,null,"Informal settlements targeted for upgrading (R'000)"]
[null,null,"Number of HH receiving this type of FBS"]
[null,null,"Living in informal backyard rental agreement (R'000)"]
[null,null,"Number of HH receiving this type of FBS"]
[null,null,"Other (R'000)",null,null,null,null,4300,4300,4300,4800,4900,4900]
[null,null,"Number of HH receiving this type of FBS"]
[null,null,"Total cost of FBS - Water  for informal settlements",null,{"$f":"E264+E266+E268+E270","v":0},{"$f":"F264+F266+F268+F270","v":0},0,4300,4300,4300,4800,4900,4900]
["Sanitation","Ref.","Location of households for each type of FBS"]
["List type of FBS service",null,"Formal settlements -  (free sanitation service to indigent households)"]
[null,null,"Number of HH receiving this type of FBS"]
[null,null,"Informal settlements (R'000)"]
[null,null,"Number of HH receiving this type of FBS"]
[null,null,"Informal settlements targeted for upgrading (R'000)"]
[null,null,"Number of HH receiving this type of FBS"]
[null,null,"Living in informal backyard rental agreement (R'000)"]
[null,null,"Number of HH receiving this type of FBS"]
[null,null,"Other (R'000)",null,null,null,null,4300,4300,4300,4800,4900,4900]
[null,null,"Number of HH receiving this type of FBS"]
[null,null,"Total cost of FBS - Sanitation for informal settlements",null,{"$f":"E276+E278+E280+E282","v":0},{"$f":"F276+F278+F280+F282","v":0},0,4300,4300,4300,4800,4900,4900]
["Refuse Removal","Ref.","Location of households for each type of FBS"]
["List type of FBS service",null,"Formal settlements -  (removed once a week to indigent households)"]
[null,null,"Number of HH receiving this type of FBS"]
[null,null,"Informal settlements (R'000)"]
[null,null,"Number of HH receiving this type of FBS"]
[null,null,"Informal settlements targeted for upgrading (R'000)"]
[null,null,"Number of HH receiving this type of FBS"]
[null,null,"Living in informal backyard rental agreement (R'000)"]
[null,null,"Number of HH receiving this type of FBS"]
[null,null,"Other (R'000)",null,null,null,null,4300,4300,4300,4800,4900,4900]
[null,null,"Number of HH receiving this type of FBS"]
[null,null,"Total cost of FBS - Refuse Removal for informal settlements",null,{"$f":"E288+E290+E292+E294","v":0},{"$f":"F288+F290+F292+F294","v":0},0,4300,4300,4300,4800,4900,4900]
[{"$f":"head27a","v":"References"}]
["1. Monthly household income threshold. Should include all sources of income."]
["2. Show the poverty analysis the municipality uses to determine its indigents policy and the provision of services"]
["3. Include total of all housing units within the municipality"]
["4. Number of subsidised dwellings to be constructed by the municipality under agency agreement with province"]
["5. Provide estimate based on building approval information. Include any non-subsidised dwellings constructed by the municipality"]
["6. Insert actual or estimated % increases assumed as a basis for budget calculations"]
["7. Insert actual or estimated % collection rate assumed as a basis for budget calculations for each revenue group"]
["8. Stand distance <= 200m from dwelling"]
["9. Stand distance > 200m from dwelling"]
["10. Borehole, spring, rain-water tank etc."]
["11. Must agree to total number of households in municipal area"]
["12. Household income categories assume an average 4 person household. Stats SA - Census 2011 Questionnaire"]
["13. Based on National poverty line of R515 per capita per month (2008 prices), assuming an average household size of 4 persons"]

{"sheet":"SA10","index":28,"n_rows":138,"n_cols":13,"rows_kept":138,"cut":false,"hidden":false,"merged":[[1,0,2,0],[1,10,1,12],[1,1,2,1],[1,2,2,2],[1,6,1,9]]}
[{"$f":"muni &\" \" & TableA10","v":"FS205 Mafube Supporting Table SA10 Funding measurement"}]
[{"$f":"desc","v":"Description"},"MFMA section",{"$f":"head27","v":"Ref"},{"$f":"head1b","v":"2013/14"},{"$f":"head1A","v":"2014/15"},{"$f":"Head1","v":"2015/16"},{"$f":"Head2","v":"Current Year 2016/17"},null,null,null,{"$f":"Head3","v":"2017/18 Medium Term Revenue & Expenditure Framework"}]
[null,null,null,{"$f":"Head5","v":"Audited Outcome"},{"$f":"Head5","v":"Audited Outcome"},{"$f":"Head5","v":"Audited Outcome"},{"$f":"Head6","v":"Original Budget"},{"$f":"Head7","v":"Adjusted Budget"},{"$f":"Head8","v":"Full Year Forecast"},{"$f":"Head5b","v":"Pre-audit outcome"},{"$f":"Head9","v":"Budget Year 2017/18"},{"$f":"Head10","v":"Budget Year +1 2018/19"},{"$f":"Head11","v":"Budget Year +2 2019/20"}]
["Funding measures"]
[{"$f":"LEFT('A7-CFlow'!A40,37)&\" - R'000\"","v":"Cash/cash equivalents at the year end - R'000"},"18(1)b",1,{"$f":"'A7-CFlow'!C40","v":3580602},{"$f":"'A7-CFlow'!D40","v":2012764},{"$f":"'A7-CFlow'!E40","v":191846},{"$f":"'A7-CFlow'!F40","v":-29555973},{"$f":"'A7-CFlow'!G40","v":201670},{"$f":"'A7-CFlow'!H40","v":201670},{"$f":"'A7-CFlow'!I40","v":240445},{"$f":"'A7-CFlow'!J40","v":-6422446.157169506},{"$f":"'A7-CFlow'!K40","v":-10229605.986129593},{"$f":"'A7-CFlow'!L40","v":-14882372.976755921}]
["Cash + investments at the yr end less applications - R'000","18(1)b",2,{"$f":"'A8-ResRecon'!C8-'A8-ResRecon'!C18","v":-199829712},{"$f":"'A8-ResRecon'!D8-'A8-ResRecon'!D18","v":-262838528},{"$f":"'A8-ResRecon'!E8-'A8-ResRecon'!E18","v":-264192638},{"$f":"'A8-ResRecon'!F8-'A8-ResRecon'!F18","v":-20723131},{"$f":"'A8-ResRecon'!G8-'A8-ResRecon'!G18","v":-2199131},{"$f":"'A8-ResRecon'!H8-'A8-ResRecon'!H18","v":-2503131},{"$f":"'A8-ResRecon'!I8-'A8-ResRecon'!I18","v":15146987},{"$f":"'A8-ResRecon'!J8-'A8-ResRecon'!J18","v":-29905917},{"$f":"'A8-ResRecon'!K8-'A8-ResRecon'!K18","v":-29928917},{"$f":"'A8-ResRecon'!L8-'A8-ResRecon'!L18","v":-29922917}]
["Cash year end/monthly employee/supplier payments","18(1)b",3,{"$f":"IF(ISERROR('SA8'!C39),0,('SA8'!C39))","v":0.25879227582606845},{"$f":"IF(ISERROR('SA8'!D39),0,('SA8'!D39))","v":0.1329988173225895},{"$f":"IF(ISERROR('SA8'!E39),0,('SA8'!E39))","v":1.2691932306734946E-2},{"$f":"IF(ISERROR('SA8'!F39),0,('SA8'!F39))","v":-2.6361235537699153},{"$f":"IF(ISERROR('SA8'!G39),0,('SA8'!G39))","v":1.7581126550131321E-2},{"$f":"IF(ISERROR('SA8'!H39),0,('SA8'!H39))","v":1.7947108937134214E-2},{"$f":"IF(ISERROR('SA8'!I39),0,('SA8'!I39))","v":-19.235600000000002},{"$f":"IF(ISERROR('SA8'!J39),0,('SA8'!J39))","v":-0.58968989978154529},{"$f":"IF(ISERROR('SA8'!K39),0,('SA8'!K39))","v":-0.89946642464235638},{"$f":"IF(ISERROR('SA8'!L39),0,('SA8'!L39))","v":-1.2432749000999221}]
["Surplus/(Deficit) excluding depreciation offsets: R'000","18(1)",4,{"$f":"'A4-FinPerf RE'!C42+'SA3'!C60","v":-158841689},{"$f":"'A4-FinPerf RE'!D42+'SA3'!D60","v":-54960990},{"$f":"'A4-FinPerf RE'!E42+'SA3'!E60","v":-50080351},{"$f":"'A4-FinPerf RE'!F42+'SA3'!F60","v":41955764.618598402},{"$f":"'A4-FinPerf RE'!G42+'SA3'!G60","v":42132368.718598425},{"$f":"'A4-FinPerf RE'!H42+'SA3'!H60","v":41955764.618598402},{"$f":"'A4-FinPerf RE'!I42+'SA3'!I60","v":0},{"$f":"'A4-FinPerf RE'!J42+'SA3'!J60","v":21678295.989680797},{"$f":"'A4-FinPerf RE'!K42+'SA3'!K60","v":25067859.293210417},{"$f":"'A4-FinPerf RE'!L42+'SA3'!L60","v":32645959.598852694}]
["Service charge rev % change - macro CPIX target exclusive","18(1)a,(2)",5,"N.A.",{"$f":"IF(ISERROR(E36-E61),0,(E36-E61))","v":0.14886864725635968},{"$f":"IF(ISERROR(F36-F61),0,(F36-F61))","v":3.1574760501902888E-3},-0.13857394051174915,-0.06,-0.06,-1.06,{"$f":"IF(ISERROR(K36-K61),0,(K36-K61))","v":1.0000015731992939E-3},1.0000000000008336E-3,1.0000000000001674E-3]
["Cash receipts % of Ratepayer & Other revenue","18(1)a,(2)",6,{"$f":"IF(ISERROR(D53/D54),0,(D53/D54))","v":0.38510195076153791},{"$f":"IF(ISERROR(E53/E54),0,(E53/E54))","v":0.4004236049297451},0.77113607987177279,0.49742000978793122,0.76428398634212447,0.76012700832010416,0,0.38939635772643527,0.3890885609059509,0.38917509263636824]
["Debt impairment expense as a % of total billable revenue","18(1)a,(2)",7,{"$f":"IF(ISERROR('A4-FinPerf RE'!C27/'SA10'!D43),0,('A4-FinPerf RE'!C27/'SA10'!D43))","v":0.55569740163457138},{"$f":"IF(ISERROR('A4-FinPerf RE'!D27/'SA10'!E43),0,('A4-FinPerf RE'!D27/'SA10'!E43))","v":0.5432743508363802},{"$f":"IF(ISERROR('A4-FinPerf RE'!E27/'SA10'!F43),0,('A4-FinPerf RE'!E27/'SA10'!F43))","v":7.4794620252688959E-2},{"$f":"IF(ISERROR('A4-FinPerf RE'!F27/'SA10'!G43),0,('A4-FinPerf RE'!F27/'SA10'!G43))","v":2.3476895911017918E-2},{"$f":"IF(ISERROR('A4-FinPerf RE'!G27/'SA10'!H43),0,('A4-FinPerf RE'!G27/'SA10'!H43))","v":2.3476895911017918E-2},{"$f":"IF(ISERROR('A4-FinPerf RE'!H27/'SA10'!I43),0,('A4-FinPerf RE'!H27/'SA10'!I43))","v":2.3476895911017918E-2},{"$f":"IF(ISERROR('A4-FinPerf RE'!I27/'SA10'!J43),0,('A4-FinPerf RE'!I27/'SA10'!J43))","v":0},{"$f":"IF(ISERROR('A4-FinPerf RE'!J27/'SA10'!K43),0,('A4-FinPerf RE'!J27/'SA10'!K43))","v":7.6505822107117968E-2},{"$f":"IF(ISERROR('A4-FinPerf RE'!K27/'SA10'!L43),0,('A4-FinPerf RE'!K27/'SA10'!L43))","v":7.6505822107117913E-2},{"$f":"IF(ISERROR('A4-FinPerf RE'!L27/'SA10'!M43),0,('A4-FinPerf RE'!L27/'SA10'!M43))","v":7.6505822107117899E-2}]
["Capital payments % of capital expenditure","18(1)c;19",8,{"$f":"IF(ISERROR(-'A7-CFlow'!C26/'A5-Capex'!C40),0,(-'A7-CFlow'!C26/'A5-Capex'!C40))","v":1.1488582180564217},{"$f":"IF(ISERROR(-'A7-CFlow'!D26/'A5-Capex'!D40),0,(-'A7-CFlow'!D26/'A5-Capex'!D40))","v":1.6559441849526375},{"$f":"IF(ISERROR(-'A7-CFlow'!E26/'A5-Capex'!E40),0,(-'A7-CFlow'!E26/'A5-Capex'!E40))","v":3.9590718026022171E-3},{"$f":"IF(ISERROR(-'A7-CFlow'!F26/'A5-Capex'!F40),0,(-'A7-CFlow'!F26/'A5-Capex'!F40))","v":1},{"$f":"IF(ISERROR(-'A7-CFlow'!G26/'A5-Capex'!G40),0,(-'A7-CFlow'!G26/'A5-Capex'!G40))","v":0.99572564684320619},{"$f":"IF(ISERROR(-'A7-CFlow'!H26/'A5-Capex'!H40),0,(-'A7-CFlow'!H26/'A5-Capex'!H40))","v":0},{"$f":"IF(ISERROR(-'A7-CFlow'!I26/'A5-Capex'!I40),0,(-'A7-CFlow'!I26/'A5-Capex'!I40))","v":0},{"$f":"IF(ISERROR(-'A7-CFlow'!J26/'A5-Capex'!J40),0,(-'A7-CFlow'!J26/'A5-Capex'!J40))","v":0.99999999999999989},{"$f":"IF(ISERROR(-'A7-CFlow'!K26/'A5-Capex'!K40),0,(-'A7-CFlow'!K26/'A5-Capex'!K40))","v":1},{"$f":"IF(ISERROR(-'A7-CFlow'!L26/'A5-Capex'!L40),0,(-'A7-CFlow'!L26/'A5-Capex'!L40))","v":1}]
["Borrowing receipts % of capital expenditure (excl. transfers)","18(1)c",9,{"$f":"IF(ISERROR('A7-CFlow'!C32/'SA10'!D52),0,('A7-CFlow'!C32/'SA10'!D52))","v":0},{"$f":"IF(ISERROR('A7-CFlow'!D32/'SA10'!E52),0,('A7-CFlow'!D32/'SA10'!E52))","v":0},{"$f":"IF(ISERROR('A7-CFlow'!E32/'SA10'!F52),0,('A7-CFlow'!E32/'SA10'!F52))","v":0},{"$f":"IF(ISERROR('A7-CFlow'!F32/'SA10'!G52),0,('A7-CFlow'!F32/'SA10'!G52))","v":0},{"$f":"IF(ISERROR('A7-CFlow'!G32/'SA10'!H52),0,('A7-CFlow'!G32/'SA10'!H52))","v":0},{"$f":"IF(ISERROR('A7-CFlow'!H32/'SA10'!I52),0,('A7-CFlow'!H32/'SA10'!I52))","v":0},{"$f":"IF(ISERROR('A7-CFlow'!I32/'SA10'!J52),0,('A7-CFlow'!I32/'SA10'!J52))","v":0},{"$f":"IF(ISERROR('A7-CFlow'!J32/'SA10'!K52),0,('A7-CFlow'!J32/'SA10'!K52))","v":0},{"$f":"IF(ISERROR('A7-CFlow'!K32/'SA10'!L52),0,('A7-CFlow'!K32/'SA10'!L52))","v":0},{"$f":"IF(ISERROR('A7-CFlow'!L32/'SA10'!M52),0,('A7-CFlow'!L32/'SA10'!M52))","v":0}]
["Grants % of Govt. legislated/gazetted allocations","18(1)a",10,null,null,null,null,null,null,null,{"$f":"IF(ISERROR(K56/K68),0,(K56/K68))","v":0},{"$f":"IF(ISERROR(L56/L68),0,(L56/L68))","v":0},{"$f":"IF(ISERROR(M56/M68),0,(M56/M68))","v":0}]
["Current consumer debtors % change - incr(decr)","18(1)a",11,"N.A.",{"$f":"IF(ISERROR(ROUND((SUM('A6-FinPos'!D8:D10)-SUM('A6-FinPos'!C8:C10))/SUM('A6-FinPos'!C8:C10),3)),0,(ROUND((SUM('A6-FinPos'!D8:D10)-SUM('A6-FinPos'!C8:C10))/SUM('A6-FinPos'!C8:C10),3)))","v":0.73899999999999999},{"$f":"IF(ISERROR(ROUND((SUM('A6-FinPos'!E8:E10)-SUM('A6-FinPos'!D8:D10))/SUM('A6-FinPos'!D8:D10),3)),0,(ROUND((SUM('A6-FinPos'!E8:E10)-SUM('A6-FinPos'!D8:D10))/SUM('A6-FinPos'!D8:D10),3)))","v":0.90500000000000003},{"$f":"IF(ISERROR(ROUND((SUM('A6-FinPos'!F8:F10)-SUM('A6-FinPos'!E8:E10))/SUM('A6-FinPos'!E8:E10),3)),0,(ROUND((SUM('A6-FinPos'!F8:F10)-SUM('A6-FinPos'!E8:E10))/SUM('A6-FinPos'!E8:E10),3)))","v":-0.47499999999999998},{"$f":"IF(ISERROR(ROUND((SUM('A6-FinPos'!G8:G10)-SUM('A6-FinPos'!F8:F10))/SUM('A6-FinPos'!F8:F10),3)),0,(ROUND((SUM('A6-FinPos'!G8:G10)-SUM('A6-FinPos'!F8:F10))/SUM('A6-FinPos'!F8:F10),3)))","v":-2.7E-2},{"$f":"IF(ISERROR(ROUND((SUM('A6-FinPos'!H8:H10)-SUM('A6-FinPos'!G8:G10))/SUM('A6-FinPos'!G8:G10),3)),0,(ROUND((SUM('A6-FinPos'!H8:H10)-SUM('A6-FinPos'!G8:G10))/SUM('A6-FinPos'!G8:G10),3)))","v":0},{"$f":"IF(ISERROR(ROUND((SUM('A6-FinPos'!I8:I10)-SUM('A6-FinPos'!H8:H10))/SUM('A6-FinPos'!H8:H10),3)),0,(ROUND((SUM('A6-FinPos'!I8:I10)-SUM('A6-FinPos'!H8:H10))/SUM('A6-FinPos'!H8:H10),3)))","v":-0.90400000000000003},{"$f":"IF(ISERROR(ROUND((SUM('A6-FinPos'!J8:J10)-SUM('A6-FinPos'!G8:G10))/SUM('A6-FinPos'!G8:G10),3)),0,(ROUND((SUM('A6-FinPos'!J8:J10)-SUM('A6-FinPos'!G8:G10))/SUM('A6-FinPos'!G8:G10),3)))","v":1.7999999999999999E-2},{"$f":"IF(ISERROR(ROUND((SUM('A6-FinPos'!K8:K10)-SUM('A6-FinPos'!J8:J10))/SUM('A6-FinPos'!J8:J10),3)),0,(ROUND((SUM('A6-FinPos'!K8:K10)-SUM('A6-FinPos'!J8:J10))/SUM('A6-FinPos'!J8:J10),3)))","v":0},{"$f":"IF(ISERROR(ROUND((SUM('A6-FinPos'!L8:L10)-SUM('A6-FinPos'!K8:K10))/SUM('A6-FinPos'!K8:K10),3)),0,(ROUND((SUM('A6-FinPos'!L8:L10)-SUM('A6-FinPos'!K8:K10))/SUM('A6-FinPos'!K8:K10),3)))","v":0}]
["Long term receivables % change - incr(decr)","18(1)a",12,"N.A.",{"$f":"IF(ISERROR(ROUND(('A6-FinPos'!D15-'A6-FinPos'!C15)/'A6-FinPos'!C15,3)),0,(ROUND(('A6-FinPos'!D15-'A6-FinPos'!C15)/'A6-FinPos'!C15,3)))","v":0},{"$f":"IF(ISERROR(ROUND(('A6-FinPos'!E15-'A6-FinPos'!D15)/'A6-FinPos'!D15,3)),0,(ROUND(('A6-FinPos'!E15-'A6-FinPos'!D15)/'A6-FinPos'!D15,3)))","v":0},{"$f":"IF(ISERROR(ROUND(('A6-FinPos'!F15-'A6-FinPos'!E15)/'A6-FinPos'!E15,3)),0,(ROUND(('A6-FinPos'!F15-'A6-FinPos'!E15)/'A6-FinPos'!E15,3)))","v":0},{"$f":"IF(ISERROR(ROUND(('A6-FinPos'!G15-'A6-FinPos'!F15)/'A6-FinPos'!F15,3)),0,(ROUND(('A6-FinPos'!G15-'A6-FinPos'!F15)/'A6-FinPos'!F15,3)))","v":0},{"$f":"IF(ISERROR(ROUND(('A6-FinPos'!H15-'A6-FinPos'!G15)/'A6-FinPos'!G15,3)),0,(ROUND(('A6-FinPos'!H15-'A6-FinPos'!G15)/'A6-FinPos'!G15,3)))","v":0},{"$f":"IF(ISERROR(ROUND(('A6-FinPos'!I15-'A6-FinPos'!H15)/'A6-FinPos'!H15,3)),0,(ROUND(('A6-FinPos'!I15-'A6-FinPos'!H15)/'A6-FinPos'!H15,3)))","v":0},{"$f":"IF(ISERROR(ROUND(('A6-FinPos'!J15-'A6-FinPos'!G15)/'A6-FinPos'!G15,3)),0,(ROUND(('A6-FinPos'!J15-'A6-FinPos'!G15)/'A6-FinPos'!G15,3)))","v":0},{"$f":"IF(ISERROR(ROUND(('A6-FinPos'!K15-'A6-FinPos'!J15)/'A6-FinPos'!J15,3)),0,(ROUND(('A6-FinPos'!K15-'A6-FinPos'!J15)/'A6-FinPos'!J15,3)))","v":0},{"$f":"IF(ISERROR(ROUND(('A6-FinPos'!L15-'A6-FinPos'!K15)/'A6-FinPos'!K15,3)),0,(ROUND(('A6-FinPos'!L15-'A6-FinPos'!K15)/'A6-FinPos'!K15,3)))","v":0}]
["R&M % of Property Plant & Equipment","20(1)(vi)",13,{"$f":"IF(ISERROR('A9-Asset'!C69/'A6-FinPos'!C19),0,('A9-Asset'!C69/'A6-FinPos'!C19))","v":9.7167374547104477E-3},{"$f":"IF(ISERROR('A9-Asset'!D69/'A6-FinPos'!D19),0,('A9-Asset'!D69/'A6-FinPos'!D19))","v":4.6824845562866597E-2},{"$f":"IF(ISERROR('A9-Asset'!E69/'A6-FinPos'!E19),0,('A9-Asset'!E69/'A6-FinPos'!E19))","v":0},{"$f":"IF(ISERROR('A9-Asset'!F69/'A6-FinPos'!F19),0,('A9-Asset'!F69/'A6-FinPos'!F19))","v":1.3298177912011511E-2},{"$f":"IF(ISERROR('A9-Asset'!G69/'A6-FinPos'!G19),0,('A9-Asset'!G69/'A6-FinPos'!G19))","v":1.3298177912011511E-2},{"$f":"IF(ISERROR('A9-Asset'!H69/'A6-FinPos'!H19),0,('A9-Asset'!H69/'A6-FinPos'!H19))","v":1.3298181338038546E-2},{"$f":"IF(ISERROR('A9-Asset'!I69/'A6-FinPos'!I19),0,('A9-Asset'!I69/'A6-FinPos'!I19))","v":0},{"$f":"IF(ISERROR('A9-Asset'!I69/'A6-FinPos'!J19),0,('A9-Asset'!I69/'A6-FinPos'!J19))","v":1.7469615302950606E-2},{"$f":"IF(ISERROR('A9-Asset'!J69/'A6-FinPos'!K19),0,('A9-Asset'!J69/'A6-FinPos'!K19))","v":1.9842766077343692E-2},{"$f":"IF(ISERROR('A9-Asset'!K69/'A6-FinPos'!L19),0,('A9-Asset'!K69/'A6-FinPos'!L19))","v":2.2938562254726728E-2}]
["Asset renewal % of capital budget",{"$f":"B17","v":"20(1)(vi)"},14,{"$f":"IF(ISERROR(D58/D57),0,(D58/D57))","v":0},0,0,5.5492923183176619E-2,5.5255726831788886E-2,0,0,0.21830320818614196,3.3577018142005019E-2,{"$f":"IF(ISERROR(M58/M57),0,((M58/M57)))","v":2.9435078671978563E-2}]
[]
[{"$f":"head27a","v":"References"}]
["1. Positive cash balances indicative of minimum compliance - subject to 2"]
["2. Deduct cash and investment applications (defined) from cash balances"]
["3. Indicative of sufficient liquidity to meet average monthly operating payments"]
["4. Indicative of funded operational requirements"]
["5. Indicative of adherence to macro-economic targets (prior to 2003/04 revenue not available for high capacity municipalities and later for other capacity classifications)"]
["6. Realistic average cash collection forecasts as % of annual billed revenue"]
["7. Realistic average increase in debt impairment (doubtful debt) provision"]
["8. Indicative of planned capital expenditure level & cash payment timing"]
["9. Indicative of compliance with borrowing 'only' for the capital budget - should not exceed 100% unless refinancing"]
["10. Substantiation of National/Province allocations included in budget"]
["11. Indicative of realistic current arrear debtor collection targets (prior to 2003/04 revenue not available for high capacity municipalities and later for other capacity classifications)"]
["12. Indicative of realistic long term arrear debtor collection targets (prior to 2003/04 revenue not available for high capacity municipalities and later for other capacity classifications)"]
["13. Indicative of a credible allowance for repairs & maintenance of assets - functioning assets revenue protection"]
["14. Indicative of a credible allowance for asset renewal (requires analysis of asset renewal projects as % of total capital projects - detailed capital plan) - functioning assets revenue protection"]
["Supporting indicators"]
["% incr total service charges (incl prop rates)","18(1)a",null,null,{"$f":"IF(ISERROR((E44/D44)-1),0,((E44/D44)-1))","v":0.20886864725635967},{"$f":"IF(ISERROR((F44/E44)-1),0,((F44/E44)-1))","v":6.3157476050190287E-2},{"$f":"IF(ISERROR((G44/F44)-1),0,((G44/F44)-1))","v":-7.8573940511749152E-2},{"$f":"IF(ISERROR((H44/G44)-1),0,((H44/G44)-1))","v":0},{"$f":"IF(ISERROR((I44/H44)-1),0,((I44/H44)-1))","v":0},{"$f":"IF(ISERROR((J44/I44)-1),0,((J44/I44)-1))","v":-1},{"$f":"IF(ISERROR((K44/H44)-1),0,((K44/H44)-1))","v":6.1000001573199292E-2},{"$f":"IF(ISERROR((L44/K44)-1),0,((L44/K44)-1))","v":6.1000000000000831E-2},{"$f":"IF(ISERROR((M44/L44)-1),0,((M44/L44)-1))","v":6.1000000000000165E-2}]
["% incr Property Tax","18(1)a",null,null,8.6179472224849674E-2,{"$f":"IF(ISERROR((F45/E45)-1),0,((F45/E45)-1))","v":7.283430124607615E-2},0.19634513309784118,0,0,-1,{"$f":"IF(ISERROR((K45/H45)-1),0,((K45/H45)-1))","v":6.0999986712532817E-2},6.1000000000001275E-2,6.0999999999999277E-2]
[{"$f":"\"% incr \"&'A4-FinPerf RE'!A7","v":"% incr Service charges - electricity revenue"},"18(1)a",null,null,-0.99595252527227573,2.3236714975845412,-1,0,0,0,0,0,{"$f":"IF(ISERROR((M46/L46)-1),0,((M46/L46)-1))","v":0}]
[{"$f":"\"% incr \"&'A4-FinPerf RE'!A8","v":"% incr Service charges - water revenue"},"18(1)a",null,null,0.68991432938113517,8.1958077667135587E-2,-0.31779276331829354,0,0,-1,6.0999999081335909E-2,6.1000000000000831E-2,6.1000000000000831E-2]
[{"$f":"\"% incr \"&'A4-FinPerf RE'!A9","v":"% incr Service charges - sanitation revenue"},"18(1)a",null,null,9.0359608193146812E-2,3.6493728619272137E-2,2.7183849129163606E-2,0,0,-1,6.1000021487213951E-2,6.1000000000001942E-2,6.0999999999998611E-2]
[{"$f":"\"% incr \"&'A4-FinPerf RE'!A10","v":"% incr Service charges - refuse revenue"},"18(1)a",null,null,-0.12527882738445073,3.7772133266509744E-2,2.5698514660247085E-2,0,0,-1,6.10000098645469E-2,6.0999999999998611E-2,6.1000000000002386E-2]
[{"$f":"\"% incr in \"&'A4-FinPerf RE'!A11","v":"% incr in Service charges - other"},"18(1)a",null,null,5.5676410711652968E-2,3.4109387454324125E-2,-1,0,{"$f":"IF(ISERROR((I50/H50)-1),0,((I50/H50)-1))","v":0},0,0,{"$f":"IF(ISERROR((L50/K50)-1),0,((L50/K50)-1))","v":0},0]
["Total billable revenue","18(1)a",null,{"$f":"SUM(D45:D50)","v":68340118},{"$f":"SUM(E45:E50)","v":82614226},87831932,80930631,80930631,80930631,0,85867399.618320003,91105310.9950376,96662734.965734899]
["Service charges",null,null,{"$f":"SUM(D45:D50)","v":68340118},{"$f":"SUM(E45:E50)","v":82614226},87831932,80930631,80930631,80930631,{"$f":"SUM(J45:J50)","v":0},85867399.618320003,91105310.9950376,96662734.965734899]
["Property rates",null,null,{"$f":"'A4-FinPerf RE'!C5+'A4-FinPerf RE'!C6","v":19474278},{"$f":"'A4-FinPerf RE'!D5+'A4-FinPerf RE'!D6","v":21152561},{"$f":"'A4-FinPerf RE'!E5+'A4-FinPerf RE'!E6","v":22693193},{"$f":"'A4-FinPerf RE'!F5+'A4-FinPerf RE'!F6","v":27148891},{"$f":"'A4-FinPerf RE'!G5+'A4-FinPerf RE'!G6","v":27148891},{"$f":"'A4-FinPerf RE'!H5+'A4-FinPerf RE'!H6","v":27148891},{"$f":"'A4-FinPerf RE'!I5+'A4-FinPerf RE'!I6","v":0},{"$f":"'A4-FinPerf RE'!J5+'A4-FinPerf RE'!J6","v":28804972.990260001},{"$f":"'A4-FinPerf RE'!K5+'A4-FinPerf RE'!K6","v":30562076.3426659},{"$f":"'A4-FinPerf RE'!L5+'A4-FinPerf RE'!L6","v":32426362.9995685}]
["Service charges - electricity revenue",null,null,{"$f":"'A4-FinPerf RE'!C7","v":-102286},{"$f":"'A4-FinPerf RE'!D7","v":-414},{"$f":"'A4-FinPerf RE'!E7","v":-1376},{"$f":"'A4-FinPerf RE'!F7","v":0},{"$f":"'A4-FinPerf RE'!G7","v":0},{"$f":"'A4-FinPerf RE'!H7","v":0},{"$f":"'A4-FinPerf RE'!I7","v":0},{"$f":"'A4-FinPerf RE'!J7","v":0},{"$f":"'A4-FinPerf RE'!K7","v":0},{"$f":"'A4-FinPerf RE'!L7","v":0}]
["Service charges - water revenue",null,null,{"$f":"'A4-FinPerf RE'!C8","v":18518134},{"$f":"'A4-FinPerf RE'!D8","v":31294060},{"$f":"'A4-FinPerf RE'!E8","v":33858861},{"$f":"'A4-FinPerf RE'!F8","v":23098760},{"$f":"'A4-FinPerf RE'!G8","v":23098760},{"$f":"'A4-FinPerf RE'!H8","v":23098760},{"$f":"'A4-FinPerf RE'!I8","v":0},{"$f":"'A4-FinPerf RE'!J8","v":24507784.338780001},{"$f":"'A4-FinPerf RE'!K8","v":26002759.183445599},{"$f":"'A4-FinPerf RE'!L8","v":27588927.4936358}]
["Service charges - sanitation revenue",null,null,{"$f":"'A4-FinPerf RE'!C9","v":15312749},{"$f":"'A4-FinPerf RE'!D9","v":16696403},{"$f":"'A4-FinPerf RE'!E9","v":17305717},{"$f":"'A4-FinPerf RE'!F9","v":17776153},{"$f":"'A4-FinPerf RE'!G9","v":17776153},{"$f":"'A4-FinPerf RE'!H9","v":17776153},{"$f":"'A4-FinPerf RE'!I9","v":0},{"$f":"'A4-FinPerf RE'!J9","v":18860498.714960001},{"$f":"'A4-FinPerf RE'!K9","v":20010989.136572599},{"$f":"'A4-FinPerf RE'!L9","v":21231659.4739035}]
["Service charges - refuse removal",null,null,{"$f":"'A4-FinPerf RE'!C10","v":13862071},{"$f":"'A4-FinPerf RE'!D10","v":12125447},{"$f":"'A4-FinPerf RE'!E10","v":12583451},{"$f":"'A4-FinPerf RE'!F10","v":12906827},{"$f":"'A4-FinPerf RE'!G10","v":12906827},{"$f":"'A4-FinPerf RE'!H10","v":12906827},{"$f":"'A4-FinPerf RE'!I10","v":0},{"$f":"'A4-FinPerf RE'!J10","v":13694143.57432},{"$f":"'A4-FinPerf RE'!K10","v":14529486.332353501},{"$f":"'A4-FinPerf RE'!L10","v":15415784.9986271}]
["Service charges - other",null,null,{"$f":"'A4-FinPerf RE'!C11","v":1275172},{"$f":"'A4-FinPerf RE'!D11","v":1346169},{"$f":"'A4-FinPerf RE'!E11","v":1392086},{"$f":"'A4-FinPerf RE'!F11","v":0},{"$f":"'A4-FinPerf RE'!G11","v":0},{"$f":"'A4-FinPerf RE'!H11","v":0},{"$f":"'A4-FinPerf RE'!I11","v":0},{"$f":"'A4-FinPerf RE'!J11","v":0},{"$f":"'A4-FinPerf RE'!K11","v":0},{"$f":"'A4-FinPerf RE'!L11","v":0}]
[{"$f":"'A4-FinPerf RE'!A12","v":"Rental of facilities and equipment"},null,null,{"$f":"'A4-FinPerf RE'!C12","v":543056},{"$f":"'A4-FinPerf RE'!D12","v":435122},{"$f":"'A4-FinPerf RE'!E12","v":136418},{"$f":"'A4-FinPerf RE'!F12","v":291440},{"$f":"'A4-FinPerf RE'!G12","v":291440},{"$f":"'A4-FinPerf RE'!H12","v":291440},{"$f":"'A4-FinPerf RE'!I12","v":0},{"$f":"'A4-FinPerf RE'!J12","v":309217.37188679999},{"$f":"'A4-FinPerf RE'!K12","v":328079.63157189498},{"$f":"'A4-FinPerf RE'!L12","v":348092.48909778002}]
["Capital expenditure excluding capital grant funding",null,null,{"$f":"'A5-Capex'!C40-'A5-Capex'!C70","v":2300232},{"$f":"'A5-Capex'!D40-'A5-Capex'!D70","v":1425967},{"$f":"'A5-Capex'!E40-'A5-Capex'!E70","v":980124},{"$f":"'A5-Capex'!F40-'A5-Capex'!F70","v":9990000},{"$f":"'A5-Capex'!G40-'A5-Capex'!G70","v":10170000},{"$f":"'A5-Capex'!H40-'A5-Capex'!H70","v":-31941635},{"$f":"'A5-Capex'!I40-'A5-Capex'!I70","v":0},{"$f":"'A5-Capex'!J40-'A5-Capex'!J70","v":1999999.9975999966},{"$f":"'A5-Capex'!K40-'A5-Capex'!K70","v":2121999.9951759987},{"$f":"'A5-Capex'!L40-'A5-Capex'!L70","v":2251442}]
["Cash receipts from ratepayers","18(1)a",null,{"$f":"'A7-CFlow'!C6+'A7-CFlow'!C7+'A7-CFlow'!C8","v":31595802},{"$f":"'A7-CFlow'!D6+'A7-CFlow'!D7+'A7-CFlow'!D8","v":42258945},{"$f":"'A7-CFlow'!E6+'A7-CFlow'!E7+'A7-CFlow'!E8","v":91001731},{"$f":"'A7-CFlow'!F6+'A7-CFlow'!F7+'A7-CFlow'!F8","v":54872094},{"$f":"'A7-CFlow'!G6+'A7-CFlow'!G7+'A7-CFlow'!G8","v":83852197},{"$f":"'A7-CFlow'!H6+'A7-CFlow'!H7+'A7-CFlow'!H8","v":83852197},{"$f":"'A7-CFlow'!I6+'A7-CFlow'!I7+'A7-CFlow'!I8","v":40096379},{"$f":"'A7-CFlow'!J6+'A7-CFlow'!J7+'A7-CFlow'!J8","v":45246643.458694488},{"$f":"'A7-CFlow'!K6+'A7-CFlow'!K7+'A7-CFlow'!K8","v":47927114.251674995},{"$f":"'A7-CFlow'!L6+'A7-CFlow'!L7+'A7-CFlow'!L8","v":50850668.691027083}]
["Ratepayer & Other revenue","18(1)a",null,{"$f":"SUM('A4-FinPerf RE'!C5:C12)+'A4-FinPerf RE'!C14+SUM('A4-FinPerf RE'!C16:C18)+'A4-FinPerf RE'!C20","v":82045292},{"$f":"SUM('A4-FinPerf RE'!D5:D12)+'A4-FinPerf RE'!D14+SUM('A4-FinPerf RE'!D16:D18)+'A4-FinPerf RE'!D20","v":105535599},{"$f":"SUM('A4-FinPerf RE'!E5:E12)+'A4-FinPerf RE'!E14+SUM('A4-FinPerf RE'!E16:E18)+'A4-FinPerf RE'!E20","v":118009951},{"$f":"SUM('A4-FinPerf RE'!F5:F12)+'A4-FinPerf RE'!F14+SUM('A4-FinPerf RE'!F16:F18)+'A4-FinPerf RE'!F20","v":110313403},{"$f":"SUM('A4-FinPerf RE'!G5:G12)+'A4-FinPerf RE'!G14+SUM('A4-FinPerf RE'!G16:G18)+'A4-FinPerf RE'!G20","v":109713403},{"$f":"SUM('A4-FinPerf RE'!H5:H12)+'A4-FinPerf RE'!H14+SUM('A4-FinPerf RE'!H16:H18)+'A4-FinPerf RE'!H20","v":110313403},{"$f":"SUM('A4-FinPerf RE'!I5:I12)+'A4-FinPerf RE'!I14+SUM('A4-FinPerf RE'!I16:I18)+'A4-FinPerf RE'!I20","v":0},{"$f":"SUM('A4-FinPerf RE'!J5:J12)+'A4-FinPerf RE'!J14+SUM('A4-FinPerf RE'!J16:J18)+'A4-FinPerf RE'!J20","v":116196884.12823281},{"$f":"SUM('A4-FinPerf RE'!K5:K12)+'A4-FinPerf RE'!K14+SUM('A4-FinPerf RE'!K16:K18)+'A4-FinPerf RE'!K20","v":123177906.18177481},{"$f":"SUM('A4-FinPerf RE'!L5:L12)+'A4-FinPerf RE'!L14+SUM('A4-FinPerf RE'!L16:L18)+'A4-FinPerf RE'!L20","v":130662700.80788594}]
["Change in consumer debtors (current and non-current)",null,null,{"$f":"D84","v":72103881},{"$f":"(SUM('A6-FinPos'!D8:D10)+'A6-FinPos'!D15)-(SUM('A6-FinPos'!C8:C10)+'A6-FinPos'!C15)","v":31996896},{"$f":"(SUM('A6-FinPos'!E8:E10)+'A6-FinPos'!E15)-(SUM('A6-FinPos'!D8:D10)+'A6-FinPos'!D15)","v":68125059},{"$f":"(SUM('A6-FinPos'!F8:F10)+'A6-FinPos'!F15)-(SUM('A6-FinPos'!E8:E10)+'A6-FinPos'!E15)","v":-68125059},{"$f":"(SUM('A6-FinPos'!G8:G10)+'A6-FinPos'!G15)-(SUM('A6-FinPos'!E8:E10)+'A6-FinPos'!E15)","v":-70158059},{"$f":"(SUM('A6-FinPos'!H8:H10)+'A6-FinPos'!H15)-(SUM('A6-FinPos'!E8:E10)+'A6-FinPos'!E15)","v":-70158059},{"$f":"(SUM('A6-FinPos'!I8:I10)+'A6-FinPos'!I15)-(SUM('A6-FinPos'!E8:E10)+'A6-FinPos'!E15)","v":-136388688},{"$f":"(SUM('A6-FinPos'!J8:J10)+'A6-FinPos'!J15)-(SUM('A6-FinPos'!F8:F10)+'A6-FinPos'!F15)","v":-733000},{"$f":"(SUM('A6-FinPos'!K8:K10)+'A6-FinPos'!K15)-(SUM('A6-FinPos'!J8:J10)+'A6-FinPos'!J15)","v":0},{"$f":"(SUM('A6-FinPos'!L8:L10)+'A6-FinPos'!L15)-(SUM('A6-FinPos'!K8:K10)+'A6-FinPos'!K15)","v":0}]
["Operating and Capital Grant Revenue","18(1)a",null,{"$f":"'A4-FinPerf RE'!C19+'A4-FinPerf RE'!C39","v":96843819},{"$f":"'A4-FinPerf RE'!D19+'A4-FinPerf RE'!D39","v":102213468},{"$f":"'A4-FinPerf RE'!E19+'A4-FinPerf RE'!E39","v":99584584},{"$f":"'A4-FinPerf RE'!F19+'A4-FinPerf RE'!F39","v":113946000},{"$f":"'A4-FinPerf RE'!G19+'A4-FinPerf RE'!G39","v":119946000},{"$f":"'A4-FinPerf RE'!H19+'A4-FinPerf RE'!H39","v":113946000},{"$f":"'A4-FinPerf RE'!I19+'A4-FinPerf RE'!I39","v":0},{"$f":"'A4-FinPerf RE'!J19+'A4-FinPerf RE'!J39","v":115252000},{"$f":"'A4-FinPerf RE'!K19+'A4-FinPerf RE'!K39","v":121031000},{"$f":"'A4-FinPerf RE'!L19+'A4-FinPerf RE'!L39","v":132158000}]
["Capital expenditure - total",{"$f":"B17","v":"20(1)(vi)"},null,{"$f":"'A5-Capex'!C40","v":25642024},{"$f":"'A5-Capex'!D40","v":14082654},{"$f":"'A5-Capex'!E40","v":9031915},{"$f":"'A5-Capex'!F40","v":41931635},{"$f":"'A5-Capex'!G40","v":42111635},{"$f":"'A5-Capex'!H40","v":0},{"$f":"'A5-Capex'!I40","v":0},{"$f":"'A5-Capex'!J40","v":33091912.757599998},{"$f":"'A5-Capex'!K40","v":31995991.885175999},{"$f":"'A5-Capex'!L40","v":38276269.364027761}]
["Capital expenditure - renewal",{"$f":"B18","v":"20(1)(vi)"},null,{"$f":"'A9-Asset'!C20","v":0},{"$f":"'A9-Asset'!D20","v":0},{"$f":"'A9-Asset'!E20","v":0},{"$f":"'A9-Asset'!F20","v":2326909},{"$f":"'A9-Asset'!G20","v":2326909},{"$f":"'A9-Asset'!H20","v":2326909},null,{"$f":"'A9-Asset'!I20","v":7224070.7199999997},{"$f":"'A9-Asset'!J20","v":1074330},{"$f":"'A9-Asset'!K20","v":1126665}]
[]
["Supporting benchmarks"]
["Growth guideline maximum",null,null,0.06,0.06,0.06,0.06,0.06,0.06,0.06,0.06,0.06,0.06]
["CPI guideline",null,null,4.2999999999999997E-2,3.9E-2,4.5999999999999999E-2,0.05,0.05,0.05,0.05,5.3999999999999999E-2,5.6000000000000001E-2,5.3999999999999999E-2]
["DoRA operating grants total MFY"]
["DoRA capital grants total MFY"]
["Provincial operating grants"]
["Provincial capital grants"]
["District Municipality grants"]
["Total gazetted/advised national, provincial and district grants",null,null,null,null,null,null,null,null,null,{"$f":"SUM(K63:K67)","v":0},{"$f":"SUM(L63:L67)","v":0},{"$f":"SUM(M63:M67)","v":0}]
["Average annual collection rate (arrears inclusive)"]
[]
["DoRA operating"]
["List operating grants"]
[]
[]
[]
[null,null,null,null,null,null,null,null,null,null,{"$f":"SUM(K72:K75)","v":0},{"$f":"SUM(L72:L75)","v":0},{"$f":"SUM(M72:M75)","v":0}]
["DoRA capital"]
["List capital grants"]
[]
[]
[]
[null,null,null,null,null,null,null,null,null,null,{"$f":"SUM(K78:K81)","v":0},{"$f":"SUM(L78:L81)","v":0},{"$f":"SUM(M78:M81)","v":0}]
["Trend"]
[{"$f":"A55","v":"Change in consumer debtors (current and non-current)"},null,null,{"$f":"TREND(E84:G84)","v":72103881},{"$f":"E55","v":31996896},{"$f":"F55","v":68125059},{"$f":"J55","v":-136388688},{"$f":"K55","v":-733000},0,0,0,0,0]
[]
["Total Operating Revenue",null,null,{"$f":"'A1-Sum'!B10","v":157757555},{"$f":"'A1-Sum'!C10","v":190732794},{"$f":"'A1-Sum'!D10","v":205174767},{"$f":"'A1-Sum'!E10","v":195792996},{"$f":"'A1-Sum'!F10","v":201192996},{"$f":"'A1-Sum'!G10","v":195792996},{"$f":"'A1-Sum'!H10","v":0},{"$f":"'A1-Sum'!I10","v":203129304.90829283},{"$f":"'A1-Sum'!J10","v":217324712.62941846},{"$f":"'A1-Sum'!K10","v":230016885.44883588}]
["Total Operating Expenditure",null,null,{"$f":"'A1-Sum'!B18","v":337918604},{"$f":"'A1-Sum'!C18","v":264202200},{"$f":"'A1-Sum'!D18","v":267891028},{"$f":"'A1-Sum'!E18","v":186259231.3814016},{"$f":"'A1-Sum'!F18","v":191482627.28140157},{"$f":"'A1-Sum'!G18","v":186259231.3814016},{"$f":"'A1-Sum'!H18","v":0},{"$f":"'A1-Sum'!I18","v":213531008.918612},{"$f":"'A1-Sum'!J18","v":223130853.33620805},{"$f":"'A1-Sum'!K18","v":234407925.84998322}]
["Operating Performance Surplus/(Deficit)",null,null,{"$f":"D86-D87","v":-180161049},{"$f":"E86-E87","v":-73469406},-62716261,9533764.6185984015,9710368.7185984254,9533764.6185984015,0,{"$f":"K86-K87","v":-10401704.010319173},-5806140.706789583,-4391040.4011473358]
["Cash and Cash Equivalents (30 June 2012)",null,null,null,null,null,null,null,null,null,{"$f":"'A7-CFlow'!J40","v":-6422446.157169506}]
["Revenue"]
["% Increase in Total Operating Revenue",null,null,null,{"$f":"IF(ISERROR(('A1-Sum'!C10-'A1-Sum'!B10)/'A1-Sum'!B10),0,(('A1-Sum'!C10-'A1-Sum'!B10)/'A1-Sum'!B10))","v":0.20902478489857426},{"$f":"IF(ISERROR(('A1-Sum'!D10-'A1-Sum'!C10)/'A1-Sum'!C10),0,(('A1-Sum'!D10-'A1-Sum'!C10)/'A1-Sum'!C10))","v":7.5718352870141462E-2},{"$f":"IF(ISERROR(('A1-Sum'!E10-'A1-Sum'!D10)/'A1-Sum'!D10),0,(('A1-Sum'!E10-'A1-Sum'!D10)/'A1-Sum'!D10))","v":-4.5725754376024219E-2},{"$f":"IF(ISERROR(('A1-Sum'!F10-'A1-Sum'!E10)/'A1-Sum'!E10),0,(('A1-Sum'!F10-'A1-Sum'!E10)/'A1-Sum'!E10))","v":2.758014898551325E-2},{"$f":"IF(ISERROR(('A1-Sum'!G10-'A1-Sum'!F10)/'A1-Sum'!F10),0,(('A1-Sum'!G10-'A1-Sum'!F10)/'A1-Sum'!F10))","v":-2.6839900530135751E-2},{"$f":"IF(ISERROR(('A1-Sum'!H10-'A1-Sum'!G10)/'A1-Sum'!G10),0,(('A1-Sum'!H10-'A1-Sum'!G10)/'A1-Sum'!G10))","v":-1},{"$f":"IF(ISERROR(('A1-Sum'!I10-'A1-Sum'!F10)/'A1-Sum'!F10),0,(('A1-Sum'!I10-'A1-Sum'!F10)/'A1-Sum'!F10))","v":9.6241367581843158E-3},{"$f":"IF(ISERROR(('A1-Sum'!J10-'A1-Sum'!I10)/'A1-Sum'!I10),0,(('A1-Sum'!J10-'A1-Sum'!I10)/'A1-Sum'!I10))","v":6.9883603094760063E-2},{"$f":"IF(ISERROR(('A1-Sum'!K10-'A1-Sum'!J10)/'A1-Sum'!J10),0,(('A1-Sum'!K10-'A1-Sum'!J10)/'A1-Sum'!J10))","v":5.8401884745892092E-2}]
["% Increase in Property Rates Revenue",null,null,null,{"$f":"IF(ISERROR(('A4-FinPerf RE'!D5-'A4-FinPerf RE'!C5)/'A4-FinPerf RE'!C5),0,(('A4-FinPerf RE'!D5-'A4-FinPerf RE'!C5)/'A4-FinPerf RE'!C5))","v":8.6179472224849618E-2},{"$f":"IF(ISERROR(('A4-FinPerf RE'!E5-'A4-FinPerf RE'!D5)/'A4-FinPerf RE'!D5),0,(('A4-FinPerf RE'!E5-'A4-FinPerf RE'!D5)/'A4-FinPerf RE'!D5))","v":7.2834301246076066E-2},{"$f":"IF(ISERROR(('A4-FinPerf RE'!F5-'A4-FinPerf RE'!E5)/'A4-FinPerf RE'!E5),0,(('A4-FinPerf RE'!F5-'A4-FinPerf RE'!E5)/'A4-FinPerf RE'!E5))","v":0.19634513309784127},{"$f":"IF(ISERROR(('A4-FinPerf RE'!G5-'A4-FinPerf RE'!F5)/'A4-FinPerf RE'!F5),0,(('A4-FinPerf RE'!G5-'A4-FinPerf RE'!F5)/'A4-FinPerf RE'!F5))","v":0},{"$f":"IF(ISERROR(('A4-FinPerf RE'!H5-'A4-FinPerf RE'!G5)/'A4-FinPerf RE'!G5),0,(('A4-FinPerf RE'!H5-'A4-FinPerf RE'!G5)/'A4-FinPerf RE'!G5))","v":0},{"$f":"IF(ISERROR(('A4-FinPerf RE'!I5-'A4-FinPerf RE'!H5)/'A4-FinPerf RE'!H5),0,(('A4-FinPerf RE'!I5-'A4-FinPerf RE'!H5)/'A4-FinPerf RE'!H5))","v":-1},{"$f":"IF(ISERROR(('A4-FinPerf RE'!J5-'A4-FinPerf RE'!G5)/'A4-FinPerf RE'!G5),0,(('A4-FinPerf RE'!J5-'A4-FinPerf RE'!G5)/'A4-FinPerf RE'!G5))","v":6.0999986712532796E-2},{"$f":"IF(ISERROR(('A4-FinPerf RE'!K5-'A4-FinPerf RE'!J5)/'A4-FinPerf RE'!J5),0,(('A4-FinPerf RE'!K5-'A4-FinPerf RE'!J5)/'A4-FinPerf RE'!J5))","v":6.1000000000001324E-2},{"$f":"IF(ISERROR(('A4-FinPerf RE'!L5-'A4-FinPerf RE'!K5)/'A4-FinPerf RE'!K5),0,(('A4-FinPerf RE'!L5-'A4-FinPerf RE'!K5)/'A4-FinPerf RE'!K5))","v":6.0999999999999353E-2}]
["% Increase in Electricity Revenue",null,null,null,{"$f":"IF(ISERROR(('A4-FinPerf RE'!D7-'A4-FinPerf RE'!C7)/'A4-FinPerf RE'!C7),0,(('A4-FinPerf RE'!D7-'A4-FinPerf RE'!C7)/'A4-FinPerf RE'!C7))","v":-0.99595252527227573},{"$f":"IF(ISERROR(('A4-FinPerf RE'!E7-'A4-FinPerf RE'!D7)/'A4-FinPerf RE'!D7),0,(('A4-FinPerf RE'!E7-'A4-FinPerf RE'!D7)/'A4-FinPerf RE'!D7))","v":2.3236714975845412},{"$f":"IF(ISERROR(('A4-FinPerf RE'!F7-'A4-FinPerf RE'!E7)/'A4-FinPerf RE'!E7),0,(('A4-FinPerf RE'!F7-'A4-FinPerf RE'!E7)/'A4-FinPerf RE'!E7))","v":-1},{"$f":"IF(ISERROR(('A4-FinPerf RE'!G7-'A4-FinPerf RE'!F7)/'A4-FinPerf RE'!F7),0,(('A4-FinPerf RE'!G7-'A4-FinPerf RE'!F7)/'A4-FinPerf RE'!F7))","v":0},{"$f":"IF(ISERROR(('A4-FinPerf RE'!H7-'A4-FinPerf RE'!G7)/'A4-FinPerf RE'!G7),0,(('A4-FinPerf RE'!H7-'A4-FinPerf RE'!G7)/'A4-FinPerf RE'!G7))","v":0},{"$f":"IF(ISERROR(('A4-FinPerf RE'!I7-'A4-FinPerf RE'!H7)/'A4-FinPerf RE'!H7),0,(('A4-FinPerf RE'!I7-'A4-FinPerf RE'!H7)/'A4-FinPerf RE'!H7))","v":0},{"$f":"IF(ISERROR(('A4-FinPerf RE'!J7-'A4-FinPerf RE'!G7)/'A4-FinPerf RE'!G7),0,(('A4-FinPerf RE'!J7-'A4-FinPerf RE'!G7)/'A4-FinPerf RE'!G7))","v":0},{"$f":"IF(ISERROR(('A4-FinPerf RE'!K7-'A4-FinPerf RE'!J7)/'A4-FinPerf RE'!J7),0,(('A4-FinPerf RE'!K7-'A4-FinPerf RE'!J7)/'A4-FinPerf RE'!J7))","v":0},{"$f":"IF(ISERROR(('A4-FinPerf RE'!L7-'A4-FinPerf RE'!K7)/'A4-FinPerf RE'!K7),0,(('A4-FinPerf RE'!L7-'A4-FinPerf RE'!K7)/'A4-FinPerf RE'!K7))","v":0}]
["% Increase in Property Rates & Services Charges",null,null,null,{"$f":"IF(ISERROR((('A1-Sum'!C5+'A1-Sum'!C6)-('A1-Sum'!B5+'A1-Sum'!B6))/('A1-Sum'!B5+'A1-Sum'!B6)),0,((('A1-Sum'!C5+'A1-Sum'!C6)-('A1-Sum'!B5+'A1-Sum'!B6))/('A1-Sum'!B5+'A1-Sum'!B6)))","v":0.20886864725635973},{"$f":"IF(ISERROR((('A1-Sum'!D5+'A1-Sum'!D6)-('A1-Sum'!C5+'A1-Sum'!C6))/('A1-Sum'!C5+'A1-Sum'!C6)),0,((('A1-Sum'!D5+'A1-Sum'!D6)-('A1-Sum'!C5+'A1-Sum'!C6))/('A1-Sum'!C5+'A1-Sum'!C6)))","v":6.3157476050190189E-2},{"$f":"IF(ISERROR((('A1-Sum'!E5+'A1-Sum'!E6)-('A1-Sum'!D5+'A1-Sum'!D6))/('A1-Sum'!D5+'A1-Sum'!D6)),0,((('A1-Sum'!E5+'A1-Sum'!E6)-('A1-Sum'!D5+'A1-Sum'!D6))/('A1-Sum'!D5+'A1-Sum'!D6)))","v":-7.8573940511749193E-2},{"$f":"IF(ISERROR((('A1-Sum'!F5+'A1-Sum'!F6)-('A1-Sum'!E5+'A1-Sum'!E6))/('A1-Sum'!E5+'A1-Sum'!E6)),0,((('A1-Sum'!F5+'A1-Sum'!F6)-('A1-Sum'!E5+'A1-Sum'!E6))/('A1-Sum'!E5+'A1-Sum'!E6)))","v":0},{"$f":"IF(ISERROR((('A1-Sum'!G5+'A1-Sum'!G6)-('A1-Sum'!F5+'A1-Sum'!F6))/('A1-Sum'!F5+'A1-Sum'!F6)),0,((('A1-Sum'!G5+'A1-Sum'!G6)-('A1-Sum'!F5+'A1-Sum'!F6))/('A1-Sum'!F5+'A1-Sum'!F6)))","v":0},{"$f":"IF(ISERROR((('A1-Sum'!H5+'A1-Sum'!H6)-('A1-Sum'!G5+'A1-Sum'!G6))/('A1-Sum'!G5+'A1-Sum'!G6)),0,((('A1-Sum'!H5+'A1-Sum'!H6)-('A1-Sum'!G5+'A1-Sum'!G6))/('A1-Sum'!G5+'A1-Sum'!G6)))","v":-1},{"$f":"IF(ISERROR((('A1-Sum'!I5+'A1-Sum'!I6)-('A1-Sum'!F5+'A1-Sum'!F6))/('A1-Sum'!F5+'A1-Sum'!F6)),0,((('A1-Sum'!I5+'A1-Sum'!I6)-('A1-Sum'!F5+'A1-Sum'!F6))/('A1-Sum'!F5+'A1-Sum'!F6)))","v":6.1000001573199188E-2},{"$f":"IF(ISERROR((('A1-Sum'!J5+'A1-Sum'!J6)-('A1-Sum'!I5+'A1-Sum'!I6))/('A1-Sum'!I5+'A1-Sum'!I6)),0,((('A1-Sum'!J5+'A1-Sum'!J6)-('A1-Sum'!I5+'A1-Sum'!I6))/('A1-Sum'!I5+'A1-Sum'!I6)))","v":6.1000000000000901E-2},{"$f":"IF(ISERROR((('A1-Sum'!K5+'A1-Sum'!K6)-('A1-Sum'!J5+'A1-Sum'!J6))/('A1-Sum'!J5+'A1-Sum'!J6)),0,((('A1-Sum'!K5+'A1-Sum'!K6)-('A1-Sum'!J5+'A1-Sum'!J6))/('A1-Sum'!J5+'A1-Sum'!J6)))","v":6.1000000000000054E-2}]
["Expenditure"]
["% Increase in Total Operating Expenditure",null,null,null,{"$f":"IF(ISERROR(('A1-Sum'!C18-'A1-Sum'!B18)/'A1-Sum'!B18),0,(('A1-Sum'!C18-'A1-Sum'!B18)/'A1-Sum'!B18))","v":-0.21814840357235851},{"$f":"IF(ISERROR(('A1-Sum'!D18-'A1-Sum'!C18)/'A1-Sum'!C18),0,(('A1-Sum'!D18-'A1-Sum'!C18)/'A1-Sum'!C18))","v":1.3962139603682332E-2},{"$f":"IF(ISERROR(('A1-Sum'!E18-'A1-Sum'!D18)/'A1-Sum'!D18),0,(('A1-Sum'!E18-'A1-Sum'!D18)/'A1-Sum'!D18))","v":-0.30472015889460247},{"$f":"IF(ISERROR(('A1-Sum'!F18-'A1-Sum'!E18)/'A1-Sum'!E18),0,(('A1-Sum'!F18-'A1-Sum'!E18)/'A1-Sum'!E18))","v":2.8043688687322394E-2},{"$f":"IF(ISERROR(('A1-Sum'!G18-'A1-Sum'!F18)/'A1-Sum'!F18),0,(('A1-Sum'!G18-'A1-Sum'!F18)/'A1-Sum'!F18))","v":-2.7278693499038473E-2},{"$f":"IF(ISERROR(('A1-Sum'!H18-'A1-Sum'!G18)/'A1-Sum'!G18),0,(('A1-Sum'!H18-'A1-Sum'!G18)/'A1-Sum'!G18))","v":-1},{"$f":"IF(ISERROR(('A1-Sum'!I18-'A1-Sum'!F18)/'A1-Sum'!F18),0,(('A1-Sum'!I18-'A1-Sum'!F18)/'A1-Sum'!F18))","v":0.11514559806414332},{"$f":"IF(ISERROR(('A1-Sum'!J18-'A1-Sum'!I18)/'A1-Sum'!I18),0,(('A1-Sum'!J18-'A1-Sum'!I18)/'A1-Sum'!I18))","v":4.4957612789883139E-2},{"$f":"IF(ISERROR(('A1-Sum'!K18-'A1-Sum'!J18)/'A1-Sum'!J18),0,(('A1-Sum'!K18-'A1-Sum'!J18)/'A1-Sum'!J18))","v":5.05401756196538E-2}]
["% Increase in Employee Costs",null,null,null,{"$f":"IF(ISERROR(('A1-Sum'!C11-'A1-Sum'!B11)/'A1-Sum'!B11),0,(('A1-Sum'!C11-'A1-Sum'!B11)/'A1-Sum'!B11))","v":-5.9662553553926398E-2},{"$f":"IF(ISERROR(('A1-Sum'!D11-'A1-Sum'!C11)/'A1-Sum'!C11),0,(('A1-Sum'!D11-'A1-Sum'!C11)/'A1-Sum'!C11))","v":5.1709890941388538E-2},{"$f":"IF(ISERROR(('A1-Sum'!E11-'A1-Sum'!D11)/'A1-Sum'!D11),0,(('A1-Sum'!E11-'A1-Sum'!D11)/'A1-Sum'!D11))","v":0.13524442776387013},{"$f":"IF(ISERROR(('A1-Sum'!F11-'A1-Sum'!E11)/'A1-Sum'!E11),0,(('A1-Sum'!F11-'A1-Sum'!E11)/'A1-Sum'!E11))","v":1.3664589678271121E-2},{"$f":"IF(ISERROR(('A1-Sum'!G11-'A1-Sum'!F11)/'A1-Sum'!F11),0,(('A1-Sum'!G11-'A1-Sum'!F11)/'A1-Sum'!F11))","v":-1.3480385738450378E-2},{"$f":"IF(ISERROR(('A1-Sum'!H11-'A1-Sum'!G11)/'A1-Sum'!G11),0,(('A1-Sum'!H11-'A1-Sum'!G11)/'A1-Sum'!G11))","v":-1},{"$f":"IF(ISERROR(('A1-Sum'!I11-'A1-Sum'!F11)/'A1-Sum'!F11),0,(('A1-Sum'!I11-'A1-Sum'!F11)/'A1-Sum'!F11))","v":-3.308321956949134E-2},{"$f":"IF(ISERROR(('A1-Sum'!J11-'A1-Sum'!I11)/'A1-Sum'!I11),0,(('A1-Sum'!J11-'A1-Sum'!I11)/'A1-Sum'!I11))","v":1.0000017717558601E-2},{"$f":"IF(ISERROR(('A1-Sum'!K11-'A1-Sum'!J11)/'A1-Sum'!J11),0,(('A1-Sum'!K11-'A1-Sum'!J11)/'A1-Sum'!J11))","v":1.0000004500943207E-2}]
["% Increase in Electricity Bulk Purchases",null,null,null,{"$f":"IF(ISERROR(('SA1'!D86-'SA1'!C86)/'SA1'!C86),0,(('SA1'!D86-'SA1'!C86)/'SA1'!C86))","v":-0.60877842268763849},{"$f":"IF(ISERROR(('SA1'!E86-'SA1'!D86)/'SA1'!D86),0,(('SA1'!E86-'SA1'!D86)/'SA1'!D86))","v":0.62911457379750479},{"$f":"IF(ISERROR(('SA1'!F86-'SA1'!E86)/'SA1'!E86),0,(('SA1'!F86-'SA1'!E86)/'SA1'!E86))","v":-0.63511390147619229},{"$f":"IF(ISERROR(('SA1'!G86-'SA1'!F86)/'SA1'!F86),0,(('SA1'!G86-'SA1'!F86)/'SA1'!F86))","v":0},{"$f":"IF(ISERROR(('SA1'!H86-'SA1'!G86)/'SA1'!G86),0,(('SA1'!H86-'SA1'!G86)/'SA1'!G86))","v":0},{"$f":"IF(ISERROR(('SA1'!I86-'SA1'!H86)/'SA1'!H86),0,(('SA1'!I86-'SA1'!H86)/'SA1'!H86))","v":-1},{"$f":"IF(ISERROR(('SA1'!J86-'SA1'!G86)/'SA1'!G86),0,(('SA1'!J86-'SA1'!G86)/'SA1'!G86))","v":0},{"$f":"IF(ISERROR(('SA1'!K86-'SA1'!J86)/'SA1'!J86),0,(('SA1'!K86-'SA1'!J86)/'SA1'!J86))","v":0.5},{"$f":"IF(ISERROR(('SA1'!L86-'SA1'!K86)/'SA1'!K86),0,(('SA1'!L86-'SA1'!K86)/'SA1'!K86))","v":0.33333333333333331}]
["Average Cost Per Budgeted Employee Position (Remuneration)",null,null,null,null,{"$f":"IF(ISERROR('A1-Sum'!D11/('SA24'!D36+'SA24'!E36-'SA24'!C5)),0,('A1-Sum'!D11/('SA24'!D36+'SA24'!E36-'SA24'!C5)))","v":155762.08686868686},{"$f":"IF(ISERROR('A1-Sum'!E11/('SA24'!F36-'SA24'!F5)),0,('A1-Sum'!E11/('SA24'!F36-'SA24'!F5)))","v":195816.28720671494},null,null,null,{"$f":"IF(ISERROR('A1-Sum'!I11/('SA24'!I36-'SA24'!I5)),0,('A1-Sum'!I11/('SA24'!I36-'SA24'!I5)))","v":191925.2807999159}]
["Average Cost Per Councillor (Remuneration)",null,null,null,null,{"$f":"IF(ISERROR('A1-Sum'!D12/'SA24'!C5),0,('A1-Sum'!D12/'SA24'!C5))","v":330207.17647058825},{"$f":"IF(ISERROR('A1-Sum'!E12/'SA24'!F5),0,('A1-Sum'!E12/'SA24'!F5))","v":348589.17647058825},null,null,null,{"$f":"IF(ISERROR('A1-Sum'!I12/'SA24'!I5),0,('A1-Sum'!I12/'SA24'!I5))","v":352075.0943764706}]
["R&M % of PPE",null,null,{"$f":"'A9-Asset'!C84","v":0.01},{"$f":"'A9-Asset'!D84","v":4.7E-2},{"$f":"'A9-Asset'!E84","v":0},{"$f":"'A9-Asset'!F84","v":1.2999999999999999E-2},{"$f":"'A9-Asset'!G84","v":1.2999999999999999E-2},{"$f":"'A9-Asset'!H84","v":1.2999999999999999E-2},null,{"$f":"'A9-Asset'!I84","v":1.7000000000000001E-2},{"$f":"'A9-Asset'!J84","v":0.02},{"$f":"'A9-Asset'!K84","v":2.3E-2}]
["Asset Renewal and R&M as a % of PPE",null,null,{"$f":"'A9-Asset'!C85","v":0.01},{"$f":"'A9-Asset'!D85","v":0.37},{"$f":"'A9-Asset'!E85","v":0},{"$f":"'A9-Asset'!F85","v":0.01},{"$f":"'A9-Asset'!G85","v":0.01},{"$f":"'A9-Asset'!H85","v":0.3},null,{"$f":"'A9-Asset'!I85","v":0.02},{"$f":"'A9-Asset'!J85","v":0.02},{"$f":"'A9-Asset'!K85","v":0.02}]
["Debt Impairment % of Total Billable Revenue",null,null,{"$f":"'SA10'!D11","v":0.55569740163457138},{"$f":"'SA10'!E11","v":0.5432743508363802},{"$f":"'SA10'!F11","v":7.4794620252688959E-2},{"$f":"'SA10'!G11","v":2.3476895911017918E-2},{"$f":"'SA10'!H11","v":2.3476895911017918E-2},{"$f":"'SA10'!I11","v":2.3476895911017918E-2},{"$f":"'SA10'!J11","v":0},{"$f":"'SA10'!K11","v":7.6505822107117968E-2},{"$f":"'SA10'!L11","v":7.6505822107117913E-2},{"$f":"'SA10'!M11","v":7.6505822107117899E-2}]
["Capital Revenue"]
["Internally Funded & Other (R'000)",null,null,{"$f":"'A1-Sum'!B29+'A1-Sum'!B31","v":2300232},{"$f":"'A1-Sum'!C29+'A1-Sum'!C31","v":1425967},{"$f":"'A1-Sum'!D29+'A1-Sum'!D31","v":980124},{"$f":"'A1-Sum'!E29+'A1-Sum'!E31","v":9990000},{"$f":"'A1-Sum'!F29+'A1-Sum'!F31","v":9990000},{"$f":"'A1-Sum'!G29+'A1-Sum'!G31","v":9990000},{"$f":"'A1-Sum'!H29+'A1-Sum'!H31","v":0},{"$f":"'A1-Sum'!I29+'A1-Sum'!I31","v":2000000},{"$f":"'A1-Sum'!J29+'A1-Sum'!J31","v":2122000},{"$f":"'A1-Sum'!K29+'A1-Sum'!K31","v":2251442}]
["Borrowing (R'000)",null,null,{"$f":"'A1-Sum'!B30","v":0},{"$f":"'A1-Sum'!C30","v":0},{"$f":"'A1-Sum'!D30","v":0},{"$f":"'A1-Sum'!E30","v":0},{"$f":"'A1-Sum'!F30","v":0},{"$f":"'A1-Sum'!G30","v":0},{"$f":"'A1-Sum'!H30","v":0},{"$f":"'A1-Sum'!I30","v":0},{"$f":"'A1-Sum'!J30","v":0},{"$f":"'A1-Sum'!K30","v":0}]
["Grant Funding and Other (R'000)",null,null,{"$f":"'A1-Sum'!B28","v":23341792},{"$f":"'A1-Sum'!C28","v":12656687},{"$f":"'A1-Sum'!D28","v":8051791},{"$f":"'A1-Sum'!E28","v":31941635},{"$f":"'A1-Sum'!F28","v":31941635},{"$f":"'A1-Sum'!G28","v":31941635},{"$f":"'A1-Sum'!H28","v":0},{"$f":"'A1-Sum'!I28","v":31091912.760000002},{"$f":"'A1-Sum'!J28","v":29873991.890000001},{"$f":"'A1-Sum'!K28","v":36024827.364027761}]
["Internally Generated funds % of Non Grant Funding",null,null,{"$f":"IF(ISERROR(('A1-Sum'!B29+'A1-Sum'!B31)/('A1-Sum'!B32-'A1-Sum'!B28)),0,(('A1-Sum'!B29+'A1-Sum'!B31)/('A1-Sum'!B32-'A1-Sum'!B28)))","v":1},{"$f":"IF(ISERROR(('A1-Sum'!C29+'A1-Sum'!C31)/('A1-Sum'!C32-'A1-Sum'!C28)),0,(('A1-Sum'!C29+'A1-Sum'!C31)/('A1-Sum'!C32-'A1-Sum'!C28)))","v":1},{"$f":"IF(ISERROR(('A1-Sum'!D29+'A1-Sum'!D31)/('A1-Sum'!D32-'A1-Sum'!D28)),0,(('A1-Sum'!D29+'A1-Sum'!D31)/('A1-Sum'!D32-'A1-Sum'!D28)))","v":1},{"$f":"IF(ISERROR(('A1-Sum'!E29+'A1-Sum'!E31)/('A1-Sum'!E32-'A1-Sum'!E28)),0,(('A1-Sum'!E29+'A1-Sum'!E31)/('A1-Sum'!E32-'A1-Sum'!E28)))","v":1},{"$f":"IF(ISERROR(('A1-Sum'!F29+'A1-Sum'!F31)/('A1-Sum'!F32-'A1-Sum'!F28)),0,(('A1-Sum'!F29+'A1-Sum'!F31)/('A1-Sum'!F32-'A1-Sum'!F28)))","v":1},{"$f":"IF(ISERROR(('A1-Sum'!G29+'A1-Sum'!G31)/('A1-Sum'!G32-'A1-Sum'!G28)),0,(('A1-Sum'!G29+'A1-Sum'!G31)/('A1-Sum'!G32-'A1-Sum'!G28)))","v":1},{"$f":"IF(ISERROR(('A1-Sum'!H29+'A1-Sum'!H31)/('A1-Sum'!H32-'A1-Sum'!H28)),0,(('A1-Sum'!H29+'A1-Sum'!H31)/('A1-Sum'!H32-'A1-Sum'!H28)))","v":0},{"$f":"IF(ISERROR(('A1-Sum'!I29+'A1-Sum'!I31)/('A1-Sum'!I32-'A1-Sum'!I28)),0,(('A1-Sum'!I29+'A1-Sum'!I31)/('A1-Sum'!I32-'A1-Sum'!I28)))","v":1},{"$f":"IF(ISERROR(('A1-Sum'!J29+'A1-Sum'!J31)/('A1-Sum'!J32-'A1-Sum'!J28)),0,(('A1-Sum'!J29+'A1-Sum'!J31)/('A1-Sum'!J32-'A1-Sum'!J28)))","v":1},{"$f":"IF(ISERROR(('A1-Sum'!K29+'A1-Sum'!K31)/('A1-Sum'!K32-'A1-Sum'!K28)),0,(('A1-Sum'!K29+'A1-Sum'!K31)/('A1-Sum'!K32-'A1-Sum'!K28)))","v":1}]
["Borrowing % of Non Grant Funding",null,null,{"$f":"IF(ISERROR('A1-Sum'!B30/('A1-Sum'!B32-'A1-Sum'!B28)),0,('A1-Sum'!B30/('A1-Sum'!B32-'A1-Sum'!B28)))","v":0},{"$f":"IF(ISERROR('A1-Sum'!C30/('A1-Sum'!C32-'A1-Sum'!C28)),0,('A1-Sum'!C30/('A1-Sum'!C32-'A1-Sum'!C28)))","v":0},{"$f":"IF(ISERROR('A1-Sum'!D30/('A1-Sum'!D32-'A1-Sum'!D28)),0,('A1-Sum'!D30/('A1-Sum'!D32-'A1-Sum'!D28)))","v":0},{"$f":"IF(ISERROR('A1-Sum'!E30/('A1-Sum'!E32-'A1-Sum'!E28)),0,('A1-Sum'!E30/('A1-Sum'!E32-'A1-Sum'!E28)))","v":0},{"$f":"IF(ISERROR('A1-Sum'!F30/('A1-Sum'!F32-'A1-Sum'!F28)),0,('A1-Sum'!F30/('A1-Sum'!F32-'A1-Sum'!F28)))","v":0},{"$f":"IF(ISERROR('A1-Sum'!G30/('A1-Sum'!G32-'A1-Sum'!G28)),0,('A1-Sum'!G30/('A1-Sum'!G32-'A1-Sum'!G28)))","v":0},{"$f":"IF(ISERROR('A1-Sum'!H30/('A1-Sum'!H32-'A1-Sum'!H28)),0,('A1-Sum'!H30/('A1-Sum'!H32-'A1-Sum'!H28)))","v":0},{"$f":"IF(ISERROR('A1-Sum'!I30/('A1-Sum'!I32-'A1-Sum'!I28)),0,('A1-Sum'!I30/('A1-Sum'!I32-'A1-Sum'!I28)))","v":0},{"$f":"IF(ISERROR('A1-Sum'!J30/('A1-Sum'!J32-'A1-Sum'!J28)),0,('A1-Sum'!J30/('A1-Sum'!J32-'A1-Sum'!J28)))","v":0},{"$f":"IF(ISERROR('A1-Sum'!K30/('A1-Sum'!K32-'A1-Sum'!K28)),0,('A1-Sum'!K30/('A1-Sum'!K32-'A1-Sum'!K28)))","v":0}]
["Grant Funding % of Total Funding",null,null,{"$f":"IF(ISERROR('A1-Sum'!B28/'A1-Sum'!B32),0,('A1-Sum'!B28/'A1-Sum'!B32))","v":0.91029444477549826},{"$f":"IF(ISERROR('A1-Sum'!C28/'A1-Sum'!C32),0,('A1-Sum'!C28/'A1-Sum'!C32))","v":0.89874302102430403},{"$f":"IF(ISERROR('A1-Sum'!D28/'A1-Sum'!D32),0,('A1-Sum'!D28/'A1-Sum'!D32))","v":0.89148214968807837},{"$f":"IF(ISERROR('A1-Sum'!E28/'A1-Sum'!E32),0,('A1-Sum'!E28/'A1-Sum'!E32))","v":0.76175505677276834},{"$f":"IF(ISERROR('A1-Sum'!F28/'A1-Sum'!F32),0,('A1-Sum'!F28/'A1-Sum'!F32))","v":0.76175505677276834},{"$f":"IF(ISERROR('A1-Sum'!G28/'A1-Sum'!G32),0,('A1-Sum'!G28/'A1-Sum'!G32))","v":0.76175505677276834},{"$f":"IF(ISERROR('A1-Sum'!H28/'A1-Sum'!H32),0,('A1-Sum'!H28/'A1-Sum'!H32))","v":0},{"$f":"IF(ISERROR('A1-Sum'!I28/'A1-Sum'!I32),0,('A1-Sum'!I28/'A1-Sum'!I32))","v":0.93956227267655834},{"$f":"IF(ISERROR('A1-Sum'!J28/'A1-Sum'!J32),0,('A1-Sum'!J28/'A1-Sum'!J32))","v":0.93367919309095682},{"$f":"IF(ISERROR('A1-Sum'!K28/'A1-Sum'!K32),0,('A1-Sum'!K28/'A1-Sum'!K32))","v":0.9411791682572932}]
["Capital Expenditure"]
["Total Capital Programme (R'000)",null,null,{"$f":"'A1-Sum'!B27","v":25642024},{"$f":"'A1-Sum'!C27","v":14082654},{"$f":"'A1-Sum'!D27","v":9031915},{"$f":"'A1-Sum'!E27","v":41931635},{"$f":"'A1-Sum'!F27","v":41931635},{"$f":"'A1-Sum'!G27","v":41931635},{"$f":"'A1-Sum'!H27","v":0},{"$f":"'A1-Sum'!I27","v":33091912.760000002},{"$f":"'A1-Sum'!J27","v":31995991.890000001},{"$f":"'A1-Sum'!K27","v":38276269.364027761}]
["Asset Renewal",null,null,{"$f":"'A1-Sum'!B55","v":0},{"$f":"'A1-Sum'!C55","v":0},{"$f":"'A1-Sum'!D55","v":0},{"$f":"'A1-Sum'!E55","v":2326909},{"$f":"'A1-Sum'!F55","v":2326909},{"$f":"'A1-Sum'!G55","v":2326909},{"$f":"'A1-Sum'!H55","v":2326909},{"$f":"'A1-Sum'!I55","v":7224070.7199999997},{"$f":"'A1-Sum'!J55","v":1074330},{"$f":"'A1-Sum'!K55","v":1126665}]
["Asset Renewal % of Total Capital Expenditure",null,null,{"$f":"IF(ISERROR('A1-Sum'!B55/'A1-Sum'!B32),0,('A1-Sum'!B55/'A1-Sum'!B32))","v":0},{"$f":"IF(ISERROR('A1-Sum'!C55/'A1-Sum'!C32),0,('A1-Sum'!C55/'A1-Sum'!C32))","v":0},{"$f":"IF(ISERROR('A1-Sum'!D55/'A1-Sum'!D32),0,('A1-Sum'!D55/'A1-Sum'!D32))","v":0},{"$f":"IF(ISERROR('A1-Sum'!E55/'A1-Sum'!E32),0,('A1-Sum'!E55/'A1-Sum'!E32))","v":5.5492923183176619E-2},{"$f":"IF(ISERROR('A1-Sum'!F55/'A1-Sum'!F32),0,('A1-Sum'!F55/'A1-Sum'!F32))","v":5.5492923183176619E-2},{"$f":"IF(ISERROR('A1-Sum'!G55/'A1-Sum'!G32),0,('A1-Sum'!G55/'A1-Sum'!G32))","v":5.5492923183176619E-2},{"$f":"IF(ISERROR('A1-Sum'!H55/'A1-Sum'!H32),0,('A1-Sum'!H55/'A1-Sum'!H32))","v":0},{"$f":"IF(ISERROR('A1-Sum'!I55/'A1-Sum'!I32),0,('A1-Sum'!I55/'A1-Sum'!I32))","v":0.21830320817030943},{"$f":"IF(ISERROR('A1-Sum'!J55/'A1-Sum'!J32),0,('A1-Sum'!J55/'A1-Sum'!J32))","v":3.3577018136942652E-2},{"$f":"IF(ISERROR('A1-Sum'!K55/'A1-Sum'!K32),0,('A1-Sum'!K55/'A1-Sum'!K32))","v":2.9435078671978563E-2}]
["Cash"]
["Cash Receipts % of Rate Payer & Other",null,null,{"$f":"'SA10'!D10","v":0.38510195076153791},{"$f":"'SA10'!E10","v":0.4004236049297451},{"$f":"'SA10'!F10","v":0.77113607987177279},{"$f":"'SA10'!G10","v":0.49742000978793122},{"$f":"'SA10'!H10","v":0.76428398634212447},{"$f":"'SA10'!I10","v":0.76012700832010416},{"$f":"'SA10'!J10","v":0},{"$f":"'SA10'!K10","v":0.38939635772643527},{"$f":"'SA10'!L10","v":0.3890885609059509},{"$f":"'SA10'!M10","v":0.38917509263636824}]
["Cash Coverage Ratio",null,null,{"$f":"'SA10'!D7","v":0.25879227582606845},{"$f":"'SA10'!E7","v":0.1329988173225895},{"$f":"'SA10'!F7","v":1.2691932306734946E-2},{"$f":"'SA10'!G7","v":-2.6361235537699153},{"$f":"'SA10'!H7","v":1.7581126550131321E-2},{"$f":"'SA10'!I7","v":1.7947108937134214E-2},{"$f":"'SA10'!J7","v":-19.235600000000002},{"$f":"'SA10'!K7","v":-0.58968989978154529},{"$f":"'SA10'!L7","v":-0.89946642464235638},{"$f":"'SA10'!M7","v":-1.2432749000999221}]
["Borrowing"]
[]
["Credit Rating (2009/10)",null,null,null,null,null,null,null,null,null,{"$f":"'SA8'!F6","v":0}]
["Capital Charges to Operating",null,null,{"$f":"'SA8'!C7","v":3.9710015492369875E-2},{"$f":"'SA8'!D7","v":5.7709716270341431E-2},{"$f":"'SA8'!E7","v":8.1376738007067559E-2},{"$f":"'SA8'!F7","v":1.7240090470601169E-2},{"$f":"'SA8'!G7","v":1.5203081560615048E-2},{"$f":"'SA8'!H7","v":1.5629432046988908E-2},{"$f":"'SA8'!I7","v":0},{"$f":"'SA8'!J7","v":1.5445400725180249E-2},{"$f":"'SA8'!K7","v":1.5682521433857514E-2},{"$f":"'SA8'!L7","v":1.5838666276054448E-2}]
["Borrowing Receipts % of Capital Expenditure",null,null,{"$f":"'SA10'!D13","v":0},{"$f":"'SA10'!E13","v":0},{"$f":"'SA10'!F13","v":0},{"$f":"'SA10'!G13","v":0},{"$f":"'SA10'!H13","v":0},{"$f":"'SA10'!I13","v":0},{"$f":"'SA10'!J13","v":0},{"$f":"'SA10'!K13","v":0},{"$f":"'SA10'!L13","v":0},{"$f":"'SA10'!M13","v":0}]
["Reserves"]
["Surplus/(Deficit)",null,null,{"$f":"'A8-ResRecon'!C19","v":-199829712},{"$f":"'A8-ResRecon'!D19","v":-262838528},{"$f":"'A8-ResRecon'!E19","v":-264192638},{"$f":"'A8-ResRecon'!F19","v":-20723131},{"$f":"'A8-ResRecon'!G19","v":-2199131},{"$f":"'A8-ResRecon'!H19","v":-2503131},{"$f":"'A8-ResRecon'!I19","v":15146987},{"$f":"'A8-ResRecon'!J19","v":-29905917},{"$f":"'A8-ResRecon'!K19","v":-29928917},{"$f":"'A8-ResRecon'!L19","v":-29922917}]
["Free Services"]
["Free Basic Services as a % of Equitable Share",null,null,{"$f":"IF(ISERROR('A10-SerDel'!C60/'SA18'!C8),0,('A10-SerDel'!C60/'SA18'!C8))","v":0},{"$f":"IF(ISERROR('A10-SerDel'!D60/'SA18'!D8),0,('A10-SerDel'!D60/'SA18'!D8))","v":0},{"$f":"IF(ISERROR('A10-SerDel'!E60/'SA18'!E8),0,('A10-SerDel'!E60/'SA18'!E8))","v":0},{"$f":"IF(ISERROR('A10-SerDel'!F60/'SA18'!F8),0,('A10-SerDel'!F60/'SA18'!F8))","v":2.227575310176911E-4},{"$f":"IF(ISERROR('A10-SerDel'!G60/'SA18'!G8),0,('A10-SerDel'!G60/'SA18'!G8))","v":2.227575310176911E-4},{"$f":"IF(ISERROR('A10-SerDel'!H60/'SA18'!H8),0,('A10-SerDel'!H60/'SA18'!H8))","v":0},null,{"$f":"IF(ISERROR('A10-SerDel'!I60/'SA18'!I8),0,('A10-SerDel'!I60/'SA18'!I8))","v":2.4470444291504166E-4},{"$f":"IF(ISERROR('A10-SerDel'!J60/'SA18'!J8),0,('A10-SerDel'!J60/'SA18'!J8))","v":2.2757883981236357E-4},{"$f":"IF(ISERROR('A10-SerDel'!K60/'SA18'!K8),0,('A10-SerDel'!K60/'SA18'!K8))","v":2.1244079296777621E-4}]
["Free Services as a % of Operating Revenue \n(excl operational transfers)",null,null,{"$f":"IF(ISERROR('A10-SerDel'!C79/('A1-Sum'!B10-'A1-Sum'!B8)),0,('A10-SerDel'!C79/('A1-Sum'!B10-'A1-Sum'!B8)))","v":0},{"$f":"IF(ISERROR('A10-SerDel'!D79/('A1-Sum'!C10-'A1-Sum'!C8)),0,('A10-SerDel'!D79/('A1-Sum'!C10-'A1-Sum'!C8)))","v":0},{"$f":"IF(ISERROR('A10-SerDel'!E79/('A1-Sum'!D10-'A1-Sum'!D8)),0,('A10-SerDel'!E79/('A1-Sum'!D10-'A1-Sum'!D8)))","v":0},{"$f":"IF(ISERROR('A10-SerDel'!F79/('A1-Sum'!E10-'A1-Sum'!E8)),0,('A10-SerDel'!F79/('A1-Sum'!E10-'A1-Sum'!E8)))","v":0},{"$f":"IF(ISERROR('A10-SerDel'!G79/('A1-Sum'!F10-'A1-Sum'!F8)),0,('A10-SerDel'!G79/('A1-Sum'!F10-'A1-Sum'!F8)))","v":0},{"$f":"IF(ISERROR('A10-SerDel'!H79/('A1-Sum'!G10-'A1-Sum'!G8)),0,('A10-SerDel'!H79/('A1-Sum'!G10-'A1-Sum'!G8)))","v":0},null,{"$f":"IF(ISERROR('A10-SerDel'!I79/('A1-Sum'!I10-'A1-Sum'!I8)),0,('A10-SerDel'!I79/('A1-Sum'!I10-'A1-Sum'!I8)))","v":0},{"$f":"IF(ISERROR('A10-SerDel'!J79/('A1-Sum'!J10-'A1-Sum'!J8)),0,('A10-SerDel'!J79/('A1-Sum'!J10-'A1-Sum'!J8)))","v":0},{"$f":"IF(ISERROR('A10-SerDel'!K79/('A1-Sum'!K10-'A1-Sum'!K8)),0,('A10-SerDel'!K79/('A1-Sum'!K10-'A1-Sum'!K8)))","v":0}]
[]
["High Level Outcome of Funding Compliance"]
["Total Operating Revenue",null,null,{"$f":"D86","v":157757555},{"$f":"E86","v":190732794},205174767,195792996,201192996,195792996,{"$f":"J86","v":0},203129304.90829283,217324712.62941846,230016885.44883588]
["Total Operating Expenditure",null,null,{"$f":"D87","v":337918604},264202200,267891028,186259231.3814016,191482627.28140157,186259231.3814016,0,213531008.918612,223130853.33620805,234407925.84998322]
["Surplus/(Deficit) Budgeted Operating Statement",null,null,-180161049,-73469406,-62716261,9533764.6185984015,9710368.7185984254,9533764.6185984015,0,-10401704.010319173,-5806140.706789583,-4391040.4011473358]
["Surplus/(Deficit) Considering Reserves and Cash Backing",null,null,{"$f":"'A8-ResRecon'!C19","v":-199829712},{"$f":"'A8-ResRecon'!D19","v":-262838528},{"$f":"'A8-ResRecon'!E19","v":-264192638},{"$f":"'A8-ResRecon'!F19","v":-20723131},{"$f":"'A8-ResRecon'!G19","v":-2199131},{"$f":"'A8-ResRecon'!H19","v":-2503131},{"$f":"'A8-ResRecon'!I19","v":15146987},{"$f":"'A8-ResRecon'!J19","v":-29905917},{"$f":"'A8-ResRecon'!K19","v":-29928917},{"$f":"'A8-ResRecon'!L19","v":-29922917}]
["MTREF Funded (1) / Unfunded (0)",null,15,{"$f":"IF(D133>=0,1,0)","v":0},{"$f":"IF(E133>=0,1,0)","v":0},0,0,0,0,1,0,0,0]
["MTREF Funded ü / Unfunded û",null,15,{"$f":"IF(D134=1,\"ü\",\"û\")","v":"û"},{"$f":"IF(E134=1,\"ü\",\"û\")","v":"û"},"û","û","û","û","ü","û","û","û"]
[]
[{"$f":"head27a","v":"References"}]
["15. Subject to figures provided in Schedule."]

{"sheet":"SA11","index":29,"n_rows":73,"n_cols":11,"rows_kept":73,"cut":false,"hidden":false,"merged":[[1,5,1,7],[1,8,1,10],[1,1,3,1],[1,0,2,0]]}
[{"$f":"muni&\" - \"&TableA11","v":"FS205 Mafube - Supporting Table SA11 Property rates summary"}]
[{"$f":"desc","v":"Description"},{"$f":"head27","v":"Ref"},{"$f":"head1b","v":"2013/14"},{"$f":"head1A","v":"2014/15"},{"$f":"Head1","v":"2015/16"},{"$f":"Head2","v":"Current Year 2016/17"},null,null,{"$f":"Head3","v":"2017/18 Medium Term Revenue & Expenditure Framework"}]
[null,null,{"$f":"Head5","v":"Audited Outcome"},{"$f":"Head5","v":"Audited Outcome"},{"$f":"Head5","v":"Audited Outcome"},{"$f":"Head6","v":"Original Budget"},{"$f":"Head7","v":"Adjusted Budget"},{"$f":"Head8","v":"Full Year Forecast"},{"$f":"Head9","v":"Budget Year 2017/18"},{"$f":"Head10","v":"Budget Year +1 2018/19"},{"$f":"Head11","v":"Budget Year +2 2019/20"}]
[]
["Valuation:",1]
["Date of valuation:",null,null,null,"2011-07-01","2015-07-01"]
["Financial year valuation used"]
["Municipal by-laws s6 in place? (Y/N)","2","Yes",null,"Yes","Yes",null,null,"Yes"]
["Municipal/assistant valuer appointed? (Y/N)",null,null,null,"Yes","Yes",null,null,"Yes"]
["Municipal partnership s38 used? (Y/N)",null,"No",null,"no","no",null,null,"no"]
["No. of assistant valuers (FTE)",3,0,null,0]
["No. of data collectors (FTE)",3,0,null,0]
["No. of internal valuers (FTE)",3,0,null,0]
["No. of external valuers (FTE)",3,1,null,1,1,1,1]
["No. of additional valuers (FTE)",4]
["Valuation appeal board established? (Y/N)",null,"Yes"]
["Implementation time of new valuation roll (mths)"]
["No. of properties",5,13806,null,13806,13806,null,null,13806]
["No. of sectional title values",5,102,null,102,299,null,null,299]
["No. of unreasonably difficult properties s7(2)",null,255,null,255,400,null,null,400]
["No. of supplementary valuations",null,null,null,0,0,null,null,0]
["No. of valuation roll amendments",null,null,null,0,0,null,null,0]
["No. of objections by rate payers",null,120,null,255,400,null,null,400]
["No. of appeals by rate payers",null,150,null,150,15,null,null,15]
["No. of successful objections",8,100,null,100,150,null,null,150]
["No. of successful objections > 10%",8]
["Supplementary valuation"]
["Public service infrastructure value (Rm)",5,445000000,null,445000000,445000000,445000000,445000000,445000000]
["Municipality owned property value (Rm)"]
["Valuation reductions:"]
["Valuation reductions-public infrastructure (Rm)"]
["Valuation reductions-nature reserves/park (Rm)"]
["Valuation reductions-mineral rights (Rm)",null,2000000]
["Valuation reductions-R15,000 threshold (Rm)",null,1000000,null,2000000,2000000,2000000,2000000,2000000]
["Valuation reductions-public worship (Rm)",null,3000000,null,1000000,1000000,1000000,1000000,1000000]
["Valuation reductions-other (Rm)",null,null,null,3000000,3000000,3000000,3000000,3000000]
["Total valuation reductions:",null,{"$f":"SUM(C31:C36)","v":6000000},{"$f":"SUM(D31:D36)","v":0},6000000,6000000,6000000,6000000,6000000,0,0]
["Total value used for rating (Rm)",5]
["Total land value (Rm)",5]
["Total value of improvements (Rm)",5]
["Total market value (Rm)",5]
[]
["Rating:"]
["Residential rate used to determine rate for other categories? (Y/N)",null,"Yes"]
["Differential rates used? (Y/N)",5]
["Limit on annual rate increase (s20)? (Y/N)"]
["Special rating area used? (Y/N)",null,"No"]
["Phasing-in properties s21 (number)"]
["Rates policy accompanying budget? (Y/N)",null,"Yes"]
["Fixed amount minimum value (R'000)"]
["Non-residential prescribed ratio s19? (%)"]
[]
["Rate revenue:"]
["Rate revenue budget (R '000)",6]
["Rate revenue expected to collect (R'000)",6]
["Expected cash collection rate (%)"]
["Special rating areas (R'000)",7,8695000,8695000,8695000,8695000,8695000,8695000,8695000]
["Rebates, exemptions - indigent (R'000)",null,1000,1000,1000,1000,1000,1000,1000]
["Rebates, exemptions - pensioners (R'000)"]
["Rebates, exemptions - bona fide farm. (R'000)"]
["Rebates, exemptions - other (R'000)",null,3000,3000,3000,3000,3000,3000,3000]
["Phase-in reductions/discounts (R'000)",null,2000,2000,2000,2000,2000,2000,2000]
["Total rebates,exemptns,reductns,discs (R'000)",null,{"$f":"SUM(C58:C62)","v":6000},{"$f":"SUM(D58:D62)","v":6000},6000,6000,6000,6000,6000,0,0]
[]
[{"$f":"head27a","v":"References"}]
["1. All numbers to be expressed as whole numbers except FTEs and Rates in the Rand"]
["2. To give effect to rates policy"]
["3. Full Time Equivalent (FTE)  should be expressed to one decimal place and takes into account full time and part time staff"]
["4. Required to implement new system (FTE)"]
["5. Provide relevant information for historical comparisons. Must reconcile to the total of Table SA12"]
[{"$f":"\"6. Current and budget year must reconcile to \"&'Template names'!F103","v":"6. Current and budget year must reconcile to Table A4 Budgeted Financial Performance (revenue and expenditure)"}]
["7. Included in rate revenue budget"]
["8. In favour of the rate-payer"]

{"sheet":"SA12a","index":30,"n_rows":56,"n_cols":19,"rows_kept":56,"cut":false,"hidden":false,"merged":[]}
[{"$f":"muni&\" - \"&TableA12a","v":"FS205 Mafube - Supporting Table SA12a Property rates by category (current year)"}]
[{"$f":"desc","v":"Description"},{"$f":"head27","v":"Ref"},"Resi.","Indust.","Bus. & Comm.","Farm props.","State-owned ","Muni props.","Public service infra.","Private owned towns","Formal & Informal Settle.","Comm. Land","State trust land","Section 8(2)(n) (note 1)","Protect. Areas","National Monum/ts","Public benefit organs.","Mining Props."]
[{"$f":"Head2","v":"Current Year 2016/17"}]
["Valuation:"]
["No. of properties"]
["No. of sectional title property values"]
["No. of unreasonably difficult properties s7(2)"]
["No. of supplementary valuations"]
["Supplementary valuation (Rm)"]
["No. of valuation roll amendments"]
["No. of objections by rate-payers"]
["No. of appeals by rate-payers"]
["No. of appeals by rate-payers finalised"]
["No. of successful objections",5]
["No. of successful objections > 10%",5,270,5,25]
["Estimated no. of properties not valued"]
["Years since last valuation (select)"]
["Frequency of valuation (select)"]
["Method of valuation used (select)"]
["Base of valuation (select)"]
["Phasing-in properties s21 (number)"]
["Combination of rating types used? (Y/N)"]
["Flat rate used? (Y/N)"]
["Is balance rated by uniform rate/variable rate?"]
["Valuation reductions:"]
["Valuation reductions-public infrastructure (Rm)"]
["Valuation reductions-nature reserves/park (Rm)"]
["Valuation reductions-mineral rights (Rm)"]
["Valuation reductions-R15,000 threshold (Rm)"]
["Valuation reductions-public worship (Rm)"]
["Valuation reductions-other (Rm)",2]
["Total valuation reductions:"]
["Total value used for rating (Rm)",6]
["Total land value (Rm)",6]
["Total value of improvements (Rm)",6]
["Total market value (Rm)",6]
["Rating:"]
["Average rate",3]
["Rate revenue budget (R '000)",null,null,null,null,null,null,null,null,null,null,null,null,null,null,null,null,null,{"$f":"SUM(C39:R39)","v":0}]
["Rate revenue expected to collect (R'000)",null,null,null,null,null,null,null,null,null,null,null,null,null,null,null,null,null,{"$f":"SUM(C40:R40)","v":0}]
["Expected cash collection rate (%)",4]
["Special rating areas (R'000)"]
["Rebates, exemptions - indigent (R'000)"]
["Rebates, exemptions - pensioners (R'000)"]
["Rebates, exemptions - bona fide farm. (R'000)",null,null,null,null,205000]
["Rebates, exemptions - other (R'000)",null,null,43000,104000,null,32000,29000]
["Phase-in reductions/discounts (R'000)",null,506000]
["Total rebates,exemptns,reductns,discs (R'000)"]
[]
[{"$f":"head27a","v":"References"}]
["1. Land & Assistance Act, Restitution of Land Rights, Communual Property Associations"]
["2. Include value of additional reductions is 'free' value greater than MPRA minimum."]
["3. Average rate - cents in  the Rand. Eg 10.26 cents in the Rand is 0.1026, expressed to 6 decimal places maximum"]
["4. Include arrears collections"]
["5. In favour of the rate-payer"]
["6. Provide relevant information for historical comparisons."]

{"sheet":"SA12b","index":31,"n_rows":56,"n_cols":19,"rows_kept":56,"cut":false,"hidden":false,"merged":[]}
[{"$f":"muni&\" - \"&TableA12b","v":"FS205 Mafube - Supporting Table SA12b Property rates by category (budget year)"}]
[{"$f":"desc","v":"Description"},{"$f":"head27","v":"Ref"},"Resi.","Indust.","Bus. & Comm.","Farm props.","State-owned ","Muni props.","Public service infra.","Private owned towns","Formal & Informal Settle.","Comm. Land","State trust land","Section 8(2)(n) (note 1)","Protect. Areas","National Monum/ts","Public benefit organs.","Mining Props."]
[{"$f":"Head9","v":"Budget Year 2017/18"}]
["Valuation:"]
["No. of properties",null,6090,12,158,2271,73,104,null,null,5034,16,null,null,null,null,58]
["No. of sectional title property values"]
["No. of unreasonably difficult properties s7(2)"]
["No. of supplementary valuations"]
["Supplementary valuation (Rm)"]
["No. of valuation roll amendments"]
["No. of objections by rate-payers",null,270,5,25]
["No. of appeals by rate-payers",null,11,4]
["No. of appeals by rate-payers finalised"]
["No. of successful objections",5]
["No. of successful objections > 10%",5]
["Estimated no. of properties not valued"]
["Years since last valuation (select)",null,1,1,1,1,1,1,null,null,1,1,null,null,null,null,1]
["Frequency of valuation (select)",null,4,4,4,4,4,4,null,null,4,4,null,null,null,null,4]
["Method of valuation used (select)",null,"other","other","other","other","other","other",null,null,"other","other",null,null,null,null,"other"]
["Base of valuation (select)"]
["Phasing-in properties s21 (number)"]
["Combination of rating types used? (Y/N)"]
["Flat rate used? (Y/N)"]
["Is balance rated by uniform rate/variable rate?"]
["Valuation reductions:"]
["Valuation reductions-public infrastructure (Rm)"]
["Valuation reductions-nature reserves/park (Rm)"]
["Valuation reductions-mineral rights (Rm)"]
["Valuation reductions-R15,000 threshold (Rm)"]
["Valuation reductions-public worship (Rm)"]
["Valuation reductions-other (Rm)",2]
["Total valuation reductions:"]
["Total value used for rating (Rm)",6]
["Total land value (Rm)",6]
["Total value of improvements (Rm)",6]
["Total market value (Rm)",6]
["Rating:"]
["Average rate",3]
["Rate revenue budget (R '000)",null,null,null,null,null,null,null,null,null,null,null,null,null,null,null,null,null,{"$f":"SUM(C39:R39)","v":0}]
["Rate revenue expected to collect (R'000)",null,null,null,null,null,null,null,null,null,null,null,null,null,null,null,null,null,{"$f":"SUM(C40:R40)","v":0}]
["Expected cash collection rate (%)",4]
["Special rating areas (R'000)"]
["Rebates, exemptions - indigent (R'000)",null,154000]
["Rebates, exemptions - pensioners (R'000)"]
["Rebates, exemptions - bona fide farm. (R'000)",null,null,null,null,185000]
["Rebates, exemptions - other (R'000)",null,null,43000,104000,null,32000,29000]
["Phase-in reductions/discounts (R'000)",null,506000]
["Total rebates,exemptns,reductns,discs (R'000)"]
[]
[{"$f":"head27a","v":"References"}]
["1. Land & Assistance Act, Restitution of Land Rights, Communual Property Associations"]
["2. Include value of additional reductions is 'free' value greater than MPRA minimum."]
["3. Average rate - cents in  the Rand. Eg 10.26 cents in the Rand is 0.1026, expressed to 6 decimal places maximum"]
["4. Include arrears collections"]
["5. In favour of the rate-payer"]
["6. Provide relevant information for historical comparisons."]

{"sheet":"SA13a","index":32,"n_rows":90,"n_cols":19,"rows_kept":90,"cut":false,"hidden":false,"merged":[[1,6,2,6],[1,0,2,0],[1,1,2,1],[1,2,2,2],[1,3,2,3],[1,4,2,4],[1,5,2,5],[93,6,94,6],[93,0,94,0],[93,1,94,1],[93,2,94,2],[93,3,94,3],[93,4,94,4],[93,5,94,5]]}
[{"$f":"muni&\" - \"&TableA13a","v":"FS205 Mafube - Supporting Table SA13a Service Tariffs by category"}]
[{"$f":"desc","v":"Description"},{"$f":"head27","v":"Ref"},"Provide description of tariff structure where appropriate",{"$f":"head1b","v":"2013/14"},{"$f":"head1A","v":"2014/15"},{"$f":"Head1","v":"2015/16"},{"$f":"Head2","v":"Current Year 2016/17"},{"$f":"Head3","v":"2017/18 Medium Term Revenue & Expenditure Framework"}]
[null,null,null,null,null,null,null,{"$f":"Head9","v":"Budget Year 2017/18"},{"$f":"Head10","v":"Budget Year +1 2018/19"},{"$f":"Head11","v":"Budget Year +2 2019/20"}]
["Property rates (rate in the Rand)",1]
["Residential properties"]
["Residential properties - vacant land",null,null,4139169.77,null,4139169.77,4387519.96,4650771.16,4929817.43,5225606.4800000004]
["Formal/informal settlements"]
["Small holdings",null,null,null,null,813719.65,862542.83,914295.4,969153.13,1027302.32]
["Farm properties - used",null,null,813719.65]
["Farm properties - not used"]
["Industrial properties",null,null,null,null,3727463.98,3951111.82,4188178.53,4439469.25,4705837.41]
["Business and commercial properties",null,null,3727463.98]
["Communal land - residential"]
["Communal land - small holdings"]
["Communal land - farm property"]
["Communal land - business and commercial"]
["Communal land - other"]
["State-owned properties",null,null,7804529.4699999997,null,7804529.4699999997,8272801.2400000002,8769169.3200000003,9295319.4800000004,9853038.6500000004]
["Municipal properties"]
["Public service infrastructure"]
["Privately owned towns serviced by the owner"]
["State trust land"]
["Restitution and redistribution properties"]
["Protected areas"]
["National monuments properties"]
[]
["Exemptions, reductions and rebates (Rands)"]
["Residential properties"]
["R15 000 threshhold rebate",null,null,15000,15000,15000,15000,15000,15000,15000]
["General residential rebate",null,null,50000,50000,50000,50000,50000,50000,50000]
["Indigent rebate or exemption"]
["Pensioners/social grants rebate or exemption "]
["Temporary relief rebate or exemption"]
[" Bona fide farmers rebate or exemption"]
["Other rebates or exemptions",2]
[]
["Water tariffs"]
["Domestic"]
["Basic charge/fixed fee (Rands/month)",null,null,null,null,6481325.4800000004,6870205.0099999998,7282417.3099999996,7719362.3485999992,8182524.089515999,null,null,null,null,null,null,null,null,{"$f":"SUM(C39:R39)","v":36535834.238115996}]
["Service point - vacant land (Rands/month)",null,null,null,null,null,null,null,null,null,null,null,null,null,null,null,null,null,{"$f":"SUM(C40:R40)","v":0}]
["Water usage - flat rate tariff (c/kl)"]
["Water usage - life line tariff",null,"6kl",null,null,912423,967168.35,1025198.49,1086710.3994,1151913.023364]
["Water usage - Block 1 (c/kl)",null,"7-30kl",null,null,2712840,2875610.4,3048147.03,3231035.8517999998,3424898.0029079998]
["Water usage - Block 2 (c/kl)",null,"31-50kl",null,null,1450321,1537340.26,1629580.68,1727355.5207999998,1830996.8520479999]
["Water usage - Block 3 (c/kl)",null,"51-80kl",null,null,624781,662267.86,702003.94,744124.1764,788771.62698399997]
["Water usage - Block 4 (c/kl)",null,"81>kl",null,null,170819,181068.14,191932.23,203448.16380000001,215655.05362800002]
["Other",2,null,null,null,null,null,null,0,0]
[]
["Waste water tariffs"]
["Domestic"]
["Basic charge/fixed fee (Rands/month)",null,null,null,null,13617320,14434359.199999999,15300420.76,16218446.0056,17191552.765935998]
["Service point - vacant land (Rands/month)"]
["Waste water - flat rate tariff (c/kl)"]
["Volumetric charge - Block 1 (c/kl)",null,"(fill in structure)"]
["Volumetric charge - Block 2 (c/kl)",null,"(fill in structure)"]
["Volumetric charge - Block 3 (c/kl)",null,"(fill in structure)"]
["Volumetric charge - Block 4 (c/kl)",null,"(fill in structure)"]
["Other",2]
[]
["Electricity tariffs"]
["Domestic"]
["Basic charge/fixed fee (Rands/month)"]
["Service point - vacant land (Rands/month)"]
["FBE",null,"(how is this targeted?)"]
["Life-line tariff - meter",null,"(describe structure)"]
["Life-line tariff - prepaid",null,"(describe structure)"]
["Flat rate tariff - meter (c/kwh)"]
["Flat rate tariff - prepaid(c/kwh)"]
["Meter - IBT Block 1 (c/kwh)",null,"(fill in thresholds)"]
["Meter - IBT Block 2 (c/kwh)",null,"(fill in thresholds)"]
["Meter - IBT Block 3 (c/kwh)",null,"(fill in thresholds)"]
["Meter - IBT Block 4 (c/kwh)",null,"(fill in thresholds)"]
["Meter - IBT Block 5 (c/kwh)",null,"(fill in thresholds)"]
["Prepaid - IBT Block 1 (c/kwh)",null,"(fill in thresholds)"]
["Prepaid - IBT Block 2 (c/kwh)",null,"(fill in thresholds)"]
["Prepaid - IBT Block 3 (c/kwh)",null,"(fill in thresholds)"]
["Prepaid - IBT Block 4 (c/kwh)",null,"(fill in thresholds)"]
["Prepaid - IBT Block 5 (c/kwh)",null,"(fill in thresholds)"]
["Other",2]
[]
["Waste management tariffs"]
["Domestic"]
["Street cleaning charge",null,null,null,null,14792734,15680298.039999999,16621115.93,17618382.8858,18675485.858948]
["Basic charge/fixed fee"]
["80l bin - once a week"]
["250l bin - once a week"]
[]
[{"$f":"head27a","v":"References"}]
["1. If properties are not rated or zero rated this must be indicated as such"]
["2.Please provide detailed descriptions on Sheet SA13b"]

{"sheet":"SA13b","index":33,"n_rows":50,"n_cols":19,"rows_kept":50,"cut":false,"hidden":false,"merged":[[94,5,95,5],[94,6,95,6],[1,6,2,6],[1,5,2,5],[94,0,95,0],[1,0,2,0],[1,1,2,1],[1,2,2,2],[1,3,2,3],[1,4,2,4],[94,1,95,1],[94,2,95,2],[94,3,95,3],[94,4,95,4]]}
[{"$f":"muni&\" - \"&TableA13b","v":"FS205 Mafube - Supporting Table SA13b Service Tariffs by category - explanatory"}]
[{"$f":"desc","v":"Description"},{"$f":"head27","v":"Ref"},"Provide description of tariff structure where appropriate",{"$f":"head1b","v":"2013/14"},{"$f":"head1A","v":"2014/15"},{"$f":"Head1","v":"2015/16"},{"$f":"Head2","v":"Current Year 2016/17"},{"$f":"Head3","v":"2017/18 Medium Term Revenue & Expenditure Framework"}]
[null,null,null,null,null,null,null,{"$f":"Head9","v":"Budget Year 2017/18"},{"$f":"Head10","v":"Budget Year +1 2018/19"},{"$f":"Head11","v":"Budget Year +2 2019/20"}]
["Exemptions, reductions and rebates (Rands)"]
["Indigent subsidy",null,null,7529210,15000000,15900000,16540000,17865240,18937154,20073382.239999998]
["All rebates together with R 50 000 of the households",null,null,3405049.66,3609352.6,3825913.8,4055468.63,4298796.75,4556724.5599999996,4830128.04]
[]
[]
[]
[]
[]
[]
[]
["Water tariffs"]
["Households tariffs",null,"6kl free",null,912423,967168,1025198,1086709.8799999999,1151912.48,1221027.23]
["Tariffs",null,"7-30 kl",null,2712840,2875610,3048147,3231035.82,3424897.97,3630391.85]
[null,null,"31-50 kl",null,1450321,1537340,1629581,1727355.86,1830997.22,1940857.06]
[null,null,"51-80 kl",null,624781,662268,702004,744124.24,788771.7,836098.01]
[null,null,"81> kl",null,170819,181068,191932,203447.92,215654.8,228594.09]
[null,null," (fill in thresholds)"]
[null,null," (fill in thresholds)"]
[null,null," (fill in thresholds)"]
[null,null," (fill in thresholds)"]
[null,null," (fill in thresholds)"]
[]
["Waste water tariffs"]
["Household tariffs",null,"(fill in structure)",null,13617320,14434359,15300420,16218445.199999999,17191551.920000002,18223045.039999999]
[null,null,"(fill in structure)"]
[null,null,"(fill in structure)"]
[null,null,"(fill in structure)"]
[null,null,"(fill in structure)"]
[null,null,"(fill in structure)"]
[null,null,"(fill in structure)"]
[null,null,"(fill in structure)"]
[null,null,"(fill in structure)"]
[]
["Electricity tariffs"]
["[Insert blocks as applicable]",null,"(fill in thresholds)"]
[null,null,"(fill in thresholds)",null,null,null,null,null,null,null,null,null,null,null,null,null,null,null,{"$f":"SUM(C39:R39)","v":0}]
[null,null,"(fill in thresholds)",null,null,null,null,null,null,null,null,null,null,null,null,null,null,null,{"$f":"SUM(C40:R40)","v":0}]
[null,null,"(fill in thresholds)"]
[null,null,"(fill in thresholds)"]
[null,null,"(fill in thresholds)"]
[null,null,"(fill in thresholds)"]
[null,null,"(fill in thresholds)"]
[null,null,"(fill in thresholds)"]
[null,null,"(fill in thresholds)"]
[null,null,"(fill in thresholds)"]
[null,null,"(fill in thresholds)"]
[null,null,"(fill in thresholds)"]

{"sheet":"SA14","index":34,"n_rows":54,"n_cols":12,"rows_kept":54,"cut":false,"hidden":false,"merged":[[1,1,3,1],[1,5,1,7],[1,0,2,0]]}
[{"$f":"muni&\" - \"&TableA14","v":"FS205 Mafube - Supporting Table SA14 Household bills"}]
[{"$f":"desc","v":"Description"},{"$f":"head27","v":"Ref"},{"$f":"head1b","v":"2013/14"},{"$f":"head1A","v":"2014/15"},{"$f":"Head1","v":"2015/16"},{"$f":"Head2","v":"Current Year 2016/17"},null,null,{"$f":"Head3","v":"2017/18 Medium Term Revenue & Expenditure Framework"}]
[null,null,{"$f":"Head5","v":"Audited Outcome"},{"$f":"Head5","v":"Audited Outcome"},{"$f":"Head5","v":"Audited Outcome"},{"$f":"Head6","v":"Original Budget"},{"$f":"Head7","v":"Adjusted Budget"},{"$f":"Head8","v":"Full Year Forecast"},{"$f":"Head9","v":"Budget Year 2017/18"},{"$f":"Head9","v":"Budget Year 2017/18"},{"$f":"Head10","v":"Budget Year +1 2018/19"},{"$f":"Head11","v":"Budget Year +2 2019/20"}]
["Rand/cent",null,null,null,null,null,null,null,"% incr."]
["Monthly Account for Household - 'Middle Income Range'",1]
["Rates and services charges:"]
["Property rates",null,466.4,513.04,559.21,620.72,620.72,620.72,0.06,657.97,697.45,739.3]
["Electricity: Basic levy"]
["Electricity: Consumption"]
["Water: Basic levy",null,25.41,26.45,28.04,29.99,29.99,29.99,0.06,31.79,33.700000000000003,35.729999999999997]
["Water: Consumption",null,175.63,187.92,199.2,211.15,211.15,211.15,0.06,223.82,237.25,251.49]
["Sanitation",null,77.22,81.849999999999994,86.76,91.97,91.97,91.97,0.06,97.49,103.34,109.54]
["Refuse removal",null,71.28,75.56,80.09,84.1,84.1,84.1,0.06,89.15,94.5,100.17]
["Other"]
["sub-total",null,{"$f":"SUM(C7:C14)","v":815.94},{"$f":"SUM(D7:D14)","v":884.81999999999994},{"$f":"SUM(E7:E14)","v":953.30000000000007},{"$f":"SUM(F7:F14)","v":1037.93},{"$f":"SUM(G7:G14)","v":1037.93},1037.93,{"$f":"IF(ISERROR(ROUND((J15-F15)/F15,3)),0,(ROUND((J15-F15)/F15,3)))","v":0.06},1100.22,1166.24,1236.23]
["VAT on Services"]
["Total large household bill:",null,{"$f":"SUM(C15:C16)","v":815.94},{"$f":"SUM(D15:D16)","v":884.81999999999994},{"$f":"SUM(E15:E16)","v":953.30000000000007},{"$f":"SUM(F15:F16)","v":1037.93},{"$f":"SUM(G15:G16)","v":1037.93},1037.93,{"$f":"IF(ISERROR(ROUND((J17-F17)/F17,3)),0,(ROUND((J17-F17)/F17,3)))","v":0.06},1100.22,1166.24,1236.23]
["% increase/-decrease",null,null,{"$f":"IF(ISERROR((D17/C17)-1),0,((D17/C17)-1))","v":8.441797190969913E-2},{"$f":"IF(ISERROR((E17/D17)-1),0,((E17/D17)-1))","v":7.7394272281368082E-2},{"$f":"IF(ISERROR((F17/E17)-1),0,((F17/E17)-1))","v":8.8775831322773557E-2},{"$f":"IF(ISERROR((G17/F17)-1),0,((G17/F17)-1))","v":0},{"$f":"IF(ISERROR((H17/G17)-1),0,((H17/G17)-1))","v":0},null,{"$f":"IF(ISERROR((J17/H17)-1),0,((J17/H17)-1))","v":6.0013681076758418E-2},{"$f":"IF(ISERROR((K17/J17)-1),0,((K17/J17)-1))","v":6.0006180582065305E-2},{"$f":"IF(ISERROR((L17/K17)-1),0,((L17/K17)-1))","v":6.001337632048287E-2}]
[]
["Monthly Account for Household - 'Affordable Range' ",2]
[{"$f":"A6","v":"Rates and services charges:"}]
[{"$f":"A7","v":"Property rates"},null,46.64,51.3,51.3,55.92,55.92,55.92,0.06,59.28,62.84,66.61]
["Electricity: Basic levy"]
["Electricity: Consumption"]
["Water: Basic levy",null,25.41,26.45,28.04,29.99,29.99,29.99,0.06,31.79,33.700000000000003,35.729999999999997]
["Water: Consumption",null,139.04,148.77000000000001,148.77000000000001,157.69999999999999,157.69999999999999,157.69999999999999,0.06,167.17,177.2,187.84]
["Sanitation",null,77.22,81.849999999999994,86.76,91.97,91.97,91.97,0.06,97.49,103.34,109.54]
["Refuse removal",null,71.28,75.56,80.09,84.1,84.1,84.1,0.06,89.15,94.5,100.17]
["Other"]
["sub-total",null,{"$f":"SUM(C22:C29)","v":359.58999999999992},383.93,394.96000000000004,419.67999999999995,419.67999999999995,419.67999999999995,{"$f":"IF(ISERROR(ROUND((J30-F30)/F30,3)),0,(ROUND((J30-F30)/F30,3)))","v":0.06},{"$f":"SUM(J22:J29)","v":444.88},{"$f":"SUM(K22:K29)","v":471.58000000000004},{"$f":"SUM(L22:L29)","v":499.89000000000004}]
["VAT on Services"]
["Total small household bill:",null,{"$f":"SUM(C30:C31)","v":359.58999999999992},383.93,394.96000000000004,419.67999999999995,419.67999999999995,419.67999999999995,{"$f":"IF(ISERROR(ROUND((J32-F32)/F32,3)),0,(ROUND((J32-F32)/F32,3)))","v":0.06},{"$f":"SUM(J30:J31)","v":444.88},{"$f":"SUM(K30:K31)","v":471.58000000000004},{"$f":"SUM(L30:L31)","v":499.89000000000004}]
["% increase/-decrease",null,null,{"$f":"IF(ISERROR((D32/C32)-1),0,((D32/C32)-1))","v":6.768820045051327E-2},{"$f":"IF(ISERROR((E32/D32)-1),0,((E32/D32)-1))","v":2.8729195426249632E-2},{"$f":"IF(ISERROR((F32/E32)-1),0,((F32/E32)-1))","v":6.2588616568766131E-2},{"$f":"IF(ISERROR((G32/F32)-1),0,((G32/F32)-1))","v":0},{"$f":"IF(ISERROR((H32/G32)-1),0,((H32/G32)-1))","v":0},null,{"$f":"IF(ISERROR((J32/H32)-1),0,((J32/H32)-1))","v":6.004574914220373E-2},{"$f":"IF(ISERROR((K32/J32)-1),0,((K32/J32)-1))","v":6.001618413954346E-2},{"$f":"IF(ISERROR((L32/K32)-1),0,((L32/K32)-1))","v":6.0032232070910574E-2}]
[null,null,null,null,{"$f":"IF(ISERROR((E33/D33)-1),0,((E33/D33)-1))","v":-0.57556567858154983},{"$f":"IF(ISERROR((F33/E33)-1),0,((F33/E33)-1))","v":1.1785718548727413},{"$f":"IF(ISERROR((G33/F33)-1),0,((G33/F33)-1))","v":-1},{"$f":"IF(ISERROR((H33/G33)-1),0,((H33/G33)-1))","v":0}]
["Monthly Account for Household - 'Indigent' Household receiving free basic services",3]
[{"$f":"A6","v":"Rates and services charges:"}]
[{"$f":"A7","v":"Property rates"},null,null,null,null,null,null,null,""]
["Electricity: Basic levy",null,null,null,null,null,null,null,""]
["Electricity: Consumption",null,null,null,null,null,null,null,""]
["Water: Basic levy",null,25.41,26.45,28.04,29.99,29.99,29.99,0.06,31.79,33.700000000000003,35.729999999999997]
["Water: Consumption",null,null,null,null,null,null,null,""]
["Sanitation",null,77.22,81.849999999999994,86.76,91.97,91.97,91.97,0.06,97.49,103.34,109.54]
["Refuse removal",null,71.28,75.56,80.09,84.1,84.1,84.1,0.06,89.15,94.5,100.17]
["Other",null,null,null,null,null,null,null,{"$f":"IF(J44>0,I13ROUND((J44-F44)/F44,3),\"\")","v":""}]
["sub-total",null,{"$f":"SUM(C37:C44)","v":173.91},{"$f":"SUM(D37:D44)","v":183.86},{"$f":"SUM(E37:E44)","v":194.89000000000001},{"$f":"SUM(F37:F44)","v":206.06},{"$f":"SUM(G37:G44)","v":206.06},206.06,{"$f":"IF(ISERROR(ROUND((J45-F45)/F45,3)),0,(ROUND((J45-F45)/F45,3)))","v":0.06},218.43,231.54000000000002,245.44]
["VAT on Services",null,null,null,null,null,null,null,{"$f":"IF(J46>0,I13ROUND((J46-F46)/F46,3),\"\")","v":""}]
["Total small household bill:",null,{"$f":"SUM(C45:C46)","v":173.91},{"$f":"SUM(D45:D46)","v":183.86},{"$f":"SUM(E45:E46)","v":194.89000000000001},{"$f":"SUM(F45:F46)","v":206.06},{"$f":"SUM(G45:G46)","v":206.06},206.06,{"$f":"IF(ISERROR(ROUND((J47-F47)/F47,3)),0,(ROUND((J47-F47)/F47,3)))","v":0.06},218.43,231.54000000000002,245.44]
[{"$f":"A18","v":"% increase/-decrease"},null,null,{"$f":"IF(ISERROR((D47/C47)-1),0,((D47/C47)-1))","v":5.721350123627178E-2},{"$f":"IF(ISERROR((E47/D47)-1),0,((E47/D47)-1))","v":5.9991297726531112E-2},{"$f":"IF(ISERROR((F47/E47)-1),0,((F47/E47)-1))","v":5.7314382472163805E-2},{"$f":"IF(ISERROR((G47/F47)-1),0,((G47/F47)-1))","v":0},{"$f":"IF(ISERROR((H47/G47)-1),0,((H47/G47)-1))","v":0},null,{"$f":"IF(ISERROR((J47/H47)-1),0,((J47/H47)-1))","v":6.0031058914879143E-2},{"$f":"IF(ISERROR((K47/J47)-1),0,((K47/J47)-1))","v":6.0019228128004531E-2},{"$f":"IF(ISERROR((L47/K47)-1),0,((L47/K47)-1))","v":6.0032823702167892E-2}]
[]
[{"$f":"head27a","v":"References"}]
["1. Use as basis property value of R700 000, 1 000 kWh electricity and 30kl water"]
["2. Use as basis property value  of R500 000 and R700 000, 500 kWh electricity and 25kl water"]
["3. Use as basis property value of R 300 000, 350kWh electricity and 20kl water (50 kWh electricity and 6 kl water free)"]
["4. Note this is for a SINGLE household."]

{"sheet":"SA15","index":35,"n_rows":36,"n_cols":11,"rows_kept":36,"cut":false,"hidden":false,"merged":[[1,5,1,7],[1,8,1,10],[1,1,3,1],[1,0,2,0]]}
[{"$f":"muni&\" - \"&TableA15","v":"FS205 Mafube - Supporting Table SA15 Investment particulars by type"}]
["Investment type",{"$f":"head27","v":"Ref"},{"$f":"head1b","v":"2013/14"},{"$f":"head1A","v":"2014/15"},{"$f":"Head1","v":"2015/16"},{"$f":"Head2","v":"Current Year 2016/17"},null,null,{"$f":"Head3","v":"2017/18 Medium Term Revenue & Expenditure Framework"}]
[null,null,{"$f":"Head5","v":"Audited Outcome"},{"$f":"Head5","v":"Audited Outcome"},{"$f":"Head5","v":"Audited Outcome"},{"$f":"Head6","v":"Original Budget"},{"$f":"Head7","v":"Adjusted Budget"},{"$f":"Head8","v":"Full Year Forecast"},{"$f":"Head9","v":"Budget Year 2017/18"},{"$f":"Head10","v":"Budget Year +1 2018/19"},{"$f":"Head11","v":"Budget Year +2 2019/20"}]
["R thousand"]
["Parent municipality"]
["Securities - National Government"]
["Listed Corporate Bonds"]
["Deposits - Bank",null,35409,125239,637367,548289,25540,null,421521,845124,1210202]
["Deposits - Public Investment Commissioners"]
["Deposits - Corporation for Public Deposits",null,323705,0,0,0,0,null,0,0,0]
["Bankers Acceptance Certificates"]
["Negotiable Certificates of Deposit - Banks"]
["Guaranteed Endowment Policies (sinking)"]
["Repurchase Agreements - Banks"]
["Municipal Bonds"]
[]
["Municipality sub-total",1,{"$f":"SUM(C6:C15)","v":359114},125239,637367,548289,25540,0,421521,845124,1210202]
[]
["Entities"]
[{"$f":"A6","v":"Securities - National Government"}]
[{"$f":"A7","v":"Listed Corporate Bonds"}]
["Deposits - Bank"]
["Deposits - Public Investment Commissioners"]
["Deposits - Corporation for Public Deposits"]
["Bankers Acceptance Certificates"]
["Negotiable Certificates of Deposit - Banks"]
["Guaranteed Endowment Policies (sinking)"]
["Repurchase Agreements - Banks"]
[]
["Entities sub-total",null,{"$f":"SUM(C20:C29)","v":0},0,0,0,0,0,0,0,0]
[]
["Consolidated total:",null,{"$f":"C17+C30","v":359114},125239,637367,548289,25540,0,421521,845124,1210202]
[]
[{"$f":"head27a","v":"References"}]
["1. Total investments must reconcile to Budgeted Financial Position ('current' call investment deposits plus 'non-current' investments)"]
["check investment balance",null,{"$f":"C17-'A6-FinPos'!C7-'A6-FinPos'!C16","v":327699},{"$f":"D17-'A6-FinPos'!D7-'A6-FinPos'!D16","v":96394},{"$f":"E17-'A6-FinPos'!E7-'A6-FinPos'!E16","v":89078},{"$f":"F17-'A6-FinPos'!F7-'A6-FinPos'!F16","v":-42794},{"$f":"G17-'A6-FinPos'!G7-'A6-FinPos'!G16","v":-565543},{"$f":"H17-'A6-FinPos'!H7-'A6-FinPos'!H16","v":-591083},{"$f":"I17-'A6-FinPos'!J7-'A6-FinPos'!J16","v":-169562},{"$f":"J17-'A6-FinPos'!K7-'A6-FinPos'!K16","v":254041},{"$f":"K17-'A6-FinPos'!L7-'A6-FinPos'!L16","v":619119}]

{"sheet":"SA16","index":36,"n_rows":32,"n_cols":15,"rows_kept":32,"cut":false,"hidden":false,"merged":[[1,3,2,3],[1,9,2,9],[2,10,2,14]]}
[{"$f":"muni&\" - \"&TableA16","v":"FS205 Mafube - Supporting Table SA16 Investment particulars by maturity"}]
["Investments by Maturity",{"$f":"head27","v":"Ref"},"Period of Investment","Type of Investment","Capital Guarantee\n(Yes/ No)","Variable or Fixed interest rate","Interest Rate \n3.","Commission Paid (Rands)","Commission Recipient","Expiry date of investment","Opening balance","Interest to be realised","Partial / Premature Withdrawal (4)","Investment Top Up","Closing Balance"]
["Name of institution & investment ID",1,"Yrs/Months"]
["Parent municipality"]
["ABSA - 9090111270",null,"Month","Call Account","No","Variable",null,"Rands","Mafube Local Municipality","Monthly",23211,100000,-15122000,15000000,{"$f":"SUM(K5:N5)","v":1211}]
["ABSA - 9229618782",null,"Month","Call Account","No","Variable",null,"Rands","Mafube Local Municipality","Monthly",1637,159,-2000,796.7,{"$f":"SUM(K6:N6)","v":592.70000000000005}]
["ABSA",null,"Month","Call Account","No","Variable",null,"Rands","Mafube Local Municipality","Monthly",2324,69,-2000,0,393]
[null,null,null,null,null,null,null,null,null,null,null,null,null,null,0]
[null,null,null,null,null,null,null,null,null,null,null,null,null,null,0]
[null,null,null,null,null,null,null,null,null,null,null,null,null,null,0]
[null,null,null,null,null,null,null,null,null,null,null,null,null,null,0]
["Municipality sub-total",null,null,null,null,null,null,null,null,null,{"$f":"SUM(K5:K11)","v":27172},null,{"$f":"SUM(M5:M11)","v":-15126000},{"$f":"SUM(N5:N11)","v":15000796.699999999},{"$f":"SUM(O5:O11)","v":2196.6999999999998}]
[]
["Entities"]
[null,null,null,null,null,null,null,null,null,null,null,null,null,null,{"$f":"SUM(K15:N15)","v":0}]
[null,null,null,null,null,null,null,null,null,null,null,null,null,null,{"$f":"SUM(K16:N16)","v":0}]
[null,null,null,null,null,null,null,null,null,null,null,null,null,null,0]
[null,null,null,null,null,null,null,null,null,null,null,null,null,null,0]
[null,null,null,null,null,null,null,null,null,null,null,null,null,null,0]
[null,null,null,null,null,null,null,null,null,null,null,null,null,null,0]
[null,null,null,null,null,null,null,null,null,null,null,null,null,null,0]
["Entities sub-total",null,null,null,null,null,null,null,null,null,{"$f":"SUM(K15:K21)","v":0},null,{"$f":"SUM(M15:M21)","v":0},{"$f":"SUM(N15:N21)","v":0},{"$f":"SUM(O15:O21)","v":0}]
[]
["TOTAL INVESTMENTS AND INTEREST",1,null,null,null,null,null,null,null,null,{"$f":"K12+K22","v":27172},null,{"$f":"M12+M22","v":-15126000},{"$f":"N12+N22","v":15000796.699999999},{"$f":"O12+O22","v":2196.6999999999998}]
[]
[{"$f":"head27a","v":"References"}]
["1. Total investments must reconcile to all items in Table SA15 for the Current Year (30 June)"]
["2. List investments in expiry date order"]
["3. If 'variable' is selected in column F, input interest rate range"]
["4. Withdrawals to be entered as negative"]
["check"]
[null,null,null,null,null,null,null,null,null,null,null,null,"`"]

{"sheet":"SA17","index":37,"n_rows":71,"n_cols":45,"rows_kept":71,"cut":false,"hidden":false,"merged":[[1,5,1,7],[1,8,1,10]]}
[{"$f":"muni&\" - \"&TableA17","v":"FS205 Mafube - Supporting Table SA17 Borrowing"}]
["Borrowing - Categorised by type",{"$f":"head27","v":"Ref"},{"$f":"head1b","v":"2013/14"},{"$f":"head1A","v":"2014/15"},{"$f":"Head1","v":"2015/16"},{"$f":"Head2","v":"Current Year 2016/17"},null,null,{"$f":"Head3","v":"2017/18 Medium Term Revenue & Expenditure Framework"}]
["R thousand",null,{"$f":"Head5","v":"Audited Outcome"},{"$f":"Head5","v":"Audited Outcome"},{"$f":"Head5","v":"Audited Outcome"},{"$f":"Head6","v":"Original Budget"},{"$f":"Head7","v":"Adjusted Budget"},{"$f":"Head8","v":"Full Year Forecast"},{"$f":"Head9","v":"Budget Year 2017/18"},{"$f":"Head10","v":"Budget Year +1 2018/19"},{"$f":"Head11","v":"Budget Year +2 2019/20"}]
["Parent municipality"]
["Long-Term Loans (annuity/reducing balance)"]
["Long-Term Loans (non-annuity)",null,2087270,1580246,1051149,789503,789503,null,525922,262341,0]
["Local registered stock",null,null," "]
["Instalment Credit"]
["Financial Leases",null,868586,545955,-22866,0,0,0,0,0,0]
["PPP liabilities"]
["Finance Granted By Cap Equipment Supplier"]
["Marketable Bonds"]
["Non-Marketable Bonds"]
["Bankers Acceptances"]
["Financial derivatives"]
["Other Securities"]
["Municipality sub-total",1,{"$f":"SUM(C5:C16)","v":2955856},{"$f":"SUM(D5:D16)","v":2126201},1028283,789503,789503,0,525922,262341,0]
[]
["Entities"]
[{"$f":"A5","v":"Long-Term Loans (annuity/reducing balance)"}]
["Long-Term Loans (non-annuity)"]
["Local registered stock"]
["Instalment Credit"]
["Financial Leases"]
["PPP liabilities"]
["Finance Granted By Cap Equipment Supplier"]
["Marketable Bonds"]
["Non-Marketable Bonds"]
["Bankers Acceptances"]
["Financial derivatives"]
["Other Securities"]
["Entities sub-total",1,{"$f":"SUM(C20:C31)","v":0},{"$f":"SUM(D20:D31)","v":0},0,0,0,0,0,0,0]
[]
["Total Borrowing",1,{"$f":"C17+C32","v":2955856},{"$f":"D17+D32","v":2126201},1028283,789503,789503,0,525922,262341,0]
[]
["Unspent Borrowing - Categorised by type"]
["Parent municipality"]
["Long-Term Loans (annuity/reducing balance)"]
["Long-Term Loans (non-annuity)"]
["Local registered stock"]
["Instalment Credit",null,null,null,null,null,null,null,null,null,null,null,null,null,null,null,null,null,null,null,null,null,null,null,null,null,null,null,null,null,null,null,null,null,null,null,null,null,null,null,null,null,439005000,null,539442200]
["Financial Leases"]
["PPP liabilities",null,null,null,null,null,null,null,null,null,null,null,null,null,null,null,null,null,null,null,null,null,0,null,0,null,null,0,null,0,null,null,0,null,0,null,null,0,null,0,null,null,1834701353,null,1241876995]
["Finance Granted By Cap Equipment Supplier",null,null,null,null,null,null,null,null,null,null,null,null,null,null,null,null,null,null,null,null,null,null,null,null,null,null,null,null,null,null,null,null,null,null,null,null,null,null,null,null,null,839041298,null,440387617]
["Marketable Bonds",null,null,null,null,null,null,null,null,null,null,null,null,null,null,null,null,null,null,null,null,null,null,null,null,null,null,null,null,null,null,null,null,null,null,null,null,null,null,null,null,null,976543638,null,782372961]
["Non-Marketable Bonds",null,null,null,null,null,null,null,null,null,null,null,null,null,null,null,null,null,null,null,null,null,null,null,null,null,null,null,null,null,null,null,null,null,null,null,null,null,null,null,null,null,19116417,null,19116417]
["Bankers Acceptances",null,null,null,null,null,null,null,null,null,null,null,null,null,null,null,null,null,null,null,null,null,null,null,null,null,null,null,null,null,null,null,null,null,null,null,null,null,null,null,null,null,2273706353,null,1781319195]
["Financial derivatives",null,null,null,null,null,null,null,null,null,null,null,null,null,null,null,null,null,null,null,null,null,null,null,null,null,null,null,null,null,null,null,null,null,null,null,null,null,null,null,null,null,180259232,null,140396729]
["Other Securities",null,null,null,null,null,null,null,null,null,null,null,null,null,null,null,null,null,null,null,null,null,null,null,null,null,null,null,null,null,null,null,null,null,null,null,null,null,null,null,null,null,125005000,null,100442200]
["Municipality sub-total",1,{"$f":"SUM(C38:C49)","v":0},{"$f":"SUM(D38:D49)","v":0},0,0,0,0,0,0,0,null,null,null,null,null,null,null,null,null,null,null,null,null,null,null,null,null,null,null,null,null,null,null,null,null,null,null,null,null,null,null,40341797,null,38954529]
[null,null,null,null,null,null,null,null,null,null,null,null,null,null,null,null,null,null,null,null,null,null,null,null,null,null,null,null,null,null,null,null,null,null,null,null,null,null,null,null,null,null,14912435,null,1000000]
["Entities"]
[{"$f":"A38","v":"Long-Term Loans (annuity/reducing balance)"}]
["Long-Term Loans (non-annuity)"]
["Local registered stock"]
["Instalment Credit"]
["Financial Leases"]
["PPP liabilities"]
["Finance Granted By Cap Equipment Supplier"]
["Marketable Bonds"]
["Non-Marketable Bonds"]
["Bankers Acceptances"]
["Financial derivatives"]
["Other Securities"]
["Entities sub-total",1,{"$f":"SUM(C53:C64)","v":0},{"$f":"SUM(D53:D64)","v":0},0,0,0,0,0,0,0]
[]
["Total Unspent Borrowing",1,{"$f":"C50+C65","v":0},{"$f":"D50+D65","v":0},0,0,0,0,0,0,0]
[]
[{"$f":"head27a","v":"References"}]
["1. Total borrowing must reconcile to Budgeted Financial Position (Borrowing - non-current)"]
["check borrowing balance",null,{"$f":"C34-'A6-FinPos'!C37","v":765445},{"$f":"D34-'A6-FinPos'!D37","v":809536},{"$f":"E34-'A6-FinPos'!E37","v":263581},{"$f":"F34-'A6-FinPos'!F37","v":-1717072},{"$f":"G34-'A6-FinPos'!G37","v":-1717072},{"$f":"H34-'A6-FinPos'!H37","v":-2506575},{"$f":"I34-'A6-FinPos'!J37","v":-1980653},{"$f":"J34-'A6-FinPos'!K37","v":-2244234},{"$f":"K34-'A6-FinPos'!L37","v":-2506575}]

{"sheet":"SA18","index":38,"n_rows":54,"n_cols":11,"rows_kept":54,"cut":false,"hidden":false,"merged":[[1,5,1,7],[1,8,1,10]]}
[{"$f":"muni&\" - \"& TableA18","v":"FS205 Mafube - Supporting Table SA18 Transfers and grant receipts"}]
[{"$f":"desc","v":"Description"},{"$f":"head27","v":"Ref"},{"$f":"head1b","v":"2013/14"},{"$f":"head1A","v":"2014/15"},{"$f":"Head1","v":"2015/16"},{"$f":"Head2","v":"Current Year 2016/17"},null,null,{"$f":"Head3","v":"2017/18 Medium Term Revenue & Expenditure Framework"}]
["R thousand",null,{"$f":"Head5","v":"Audited Outcome"},{"$f":"Head5","v":"Audited Outcome"},{"$f":"Head5","v":"Audited Outcome"},{"$f":"Head6","v":"Original Budget"},{"$f":"Head7","v":"Adjusted Budget"},{"$f":"Head8","v":"Full Year Forecast"},{"$f":"Head9","v":"Budget Year 2017/18"},{"$f":"Head10","v":"Budget Year +1 2018/19"},{"$f":"Head11","v":"Budget Year +2 2019/20"}]
["RECEIPTS:","1, 2"]
[]
["Operating Transfers and Grants"]
["National Government:",null,{"$f":"SUM(C8:C14)","v":70985601},{"$f":"SUM(D8:D14)","v":80412000},82392000,81524000,81524000,0,83172000,90157000,95121000]
["Local Government Equitable Share",{"$f":"IF(A8=\"  Levy replacement\",3,\"\")","v":""},67799171,76678000,78587000,77214000,77214000,null,78462000,86124000,92261000]
["Finance Management ","",1649873,1800000,1875000,2010000,2010000,null,2345000,2600000,2860000]
["Municipal Systems Improvement","",890000,934000,930000,1300000,1300000,null,1365000,1433000,0]
["EPWP Incentive","",646557,1000000,1000000,1000000,1000000,null,1000000,0,0]
[null,""]
[null,""]
["  Other transfers/grants [insert description]"]
["Provincial Government:",null,{"$f":"SUM(C16:C20)","v":4538858},{"$f":"SUM(D16:D20)","v":3000000},5200000,0,6000000,0,0,0,0]
["Treasury and Cooperative Governance and Traditional Affairs (COGTA)",{"$f":"IF(A16=\"  Housing\",4,\"\")","v":""},4538858,3000000,5200000,0,6000000,0,0,0,0]
[null,{"$f":"IF(A17=\"  Housing\",4,\"\")","v":""}]
[null,{"$f":"IF(A18=\"  Housing\",4,\"\")","v":""}]
[null,{"$f":"IF(A19=\"  Housing\",4,\"\")","v":""}]
[{"$f":"A14","v":"  Other transfers/grants [insert description]"}]
["District Municipality:",null,{"$f":"SUM(C22:C23)","v":1476728},{"$f":"SUM(D22:D23)","v":0},0,0,0,0,0,0,0]
["fezile Dabi District Municipality",null,1476728]
[]
["Other grant providers:",null,{"$f":"SUM(C25:C26)","v":0},{"$f":"SUM(D25:D26)","v":0},0,0,0,0,0,0,0]
["  [insert description]"]
[]
["Total Operating Transfers and Grants",5,{"$f":"C7+C15+C21+C24","v":77001187},{"$f":"D7+D15+D21+D24","v":83412000},87592000,81524000,87524000,0,83172000,90157000,95121000]
[]
["Capital Transfers and Grants"]
[{"$f":"A7","v":"National Government:"},null,{"$f":"SUM(C31:C37)","v":14947283},{"$f":"SUM(D31:D37)","v":0},0,32422000,32422000,0,32080000,30874000,37037000]
[" Municipal Infrastructure Grant (MIG)",null,14947283,null,null,21422000,21422000,null,27080000,23874000,25037000]
[]
[]
[]
[]
["Energy Efficiency Demand Management Grant",null,null,null,null,5000000,5000000]
["Integrated National Electrification Grant",null,null,null,null,6000000,6000000,null,5000000,7000000,12000000]
[{"$f":"A15","v":"Provincial Government:"},null,{"$f":"SUM(C39)","v":0},{"$f":"SUM(D39)","v":0},0,0,0,0,0,0,0]
["Other capital transfers/grants [insert description]"]
[{"$f":"A21","v":"District Municipality:"},null,{"$f":"SUM(C41:C42)","v":0},0,0,0,0,0,0,0,0]
[{"$f":"A22","v":"fezile Dabi District Municipality"}]
[]
[{"$f":"A24","v":"Other grant providers:"},null,{"$f":"SUM(C44:C45)","v":0},{"$f":"SUM(D44:D45)","v":0},0,0,0,0,0,0,0]
[{"$f":"LEFT(A25,22)","v":"  [insert description]"}]
[]
["Total Capital Transfers and Grants",5,{"$f":"C30+C38+C40+C43","v":14947283},0,0,32422000,32422000,0,32080000,30874000,37037000]
["TOTAL RECEIPTS OF TRANSFERS & GRANTS",null,{"$f":"C27+C46","v":91948470},83412000,87592000,113946000,119946000,0,115252000,121031000,132158000]
[{"$f":"head27a","v":"References"}]
["1. Each transfer/grant is listed by name as gazetted together with the name of the transferring department or municipality, donor or other organisation"]
["2. Amounts actually RECEIVED; not revenue recognised (objective is to confirm grants transferred)"]
["3. Replacement of RSC levies"]
["4. Housing subsidies for housing where ownership transferred to organisations or persons outside the control of the municipality"]
["5. Total transfers and grants must reconcile to Budgeted Cash Flows"]
["6. Motor vehicle licensing refunds to be included under 'agency' services (Not Grant Receipts)"]

{"sheet":"SA19","index":39,"n_rows":50,"n_cols":11,"rows_kept":50,"cut":false,"hidden":false,"merged":[[1,5,1,7],[1,8,1,10]]}
[{"$f":"muni&\" - \"& TableA19","v":"FS205 Mafube - Supporting Table SA19 Expenditure on transfers and grant programme"}]
[{"$f":"desc","v":"Description"},{"$f":"head27","v":"Ref"},{"$f":"head1b","v":"2013/14"},{"$f":"head1A","v":"2014/15"},{"$f":"Head1","v":"2015/16"},{"$f":"Head2","v":"Current Year 2016/17"},null,null,{"$f":"Head3","v":"2017/18 Medium Term Revenue & Expenditure Framework"}]
["R thousand",null,{"$f":"Head5","v":"Audited Outcome"},{"$f":"Head5","v":"Audited Outcome"},{"$f":"Head5","v":"Audited Outcome"},{"$f":"Head6","v":"Original Budget"},{"$f":"Head7","v":"Adjusted Budget"},{"$f":"Head8","v":"Full Year Forecast"},{"$f":"Head9","v":"Budget Year 2017/18"},{"$f":"Head10","v":"Budget Year +1 2018/19"},{"$f":"Head11","v":"Budget Year +2 2019/20"}]
["EXPENDITURE:",1]
[]
["Operating expenditure of Transfers and Grants"]
[{"$f":"'SA18'!A7","v":"National Government:"},null,{"$f":"SUM(C8:C14)","v":70985601},{"$f":"SUM(D8:D14)","v":81146369},81225455,81524000,81524000,0,83172000,90157000,95121000]
[{"$f":"IF('SA18'!A8=\"\",\"\",'SA18'!A8)","v":"Local Government Equitable Share"},null,67799171,76678000,78587000,77214000,77214000,null,78462000,86124000,92261000]
[{"$f":"IF('SA18'!A9=\"\",\"\",'SA18'!A9)","v":"Finance Management "},null,1649873,1782604,1034197,2010000,2010000,null,2345000,2600000,2860000]
[{"$f":"IF('SA18'!A10=\"\",\"\",'SA18'!A10)","v":"Municipal Systems Improvement"},null,890000,934000,930000,1300000,1300000,null,1365000,1433000]
[{"$f":"IF('SA18'!A11=\"\",\"\",'SA18'!A11)","v":"EPWP Incentive"},null,646557,1751765,674258,1000000,1000000,null,1000000]
[{"$f":"IF('SA18'!A12=\"\",\"\",'SA18'!A12)","v":""}]
[{"$f":"IF('SA18'!A13=\"\",\"\",'SA18'!A13)","v":""}]
[{"$f":"'SA18'!A14","v":"  Other transfers/grants [insert description]"}]
[{"$f":"'SA18'!A15","v":"Provincial Government:"},null,{"$f":"SUM(C16:C20)","v":4538858},{"$f":"SUM(D16:D20)","v":3000000},5200000,0,6000000,0,0,0,0]
[{"$f":"IF('SA18'!A16=\"\",\"\",'SA18'!A16)","v":"Treasury and Cooperative Governance and Traditional Affairs (COGTA)"},null,4538858,3000000,5200000,null,6000000]
[{"$f":"IF('SA18'!A17=\"\",\"\",'SA18'!A17)","v":""}]
[{"$f":"IF('SA18'!A18=\"\",\"\",'SA18'!A18)","v":""}]
[{"$f":"IF('SA18'!A19=\"\",\"\",'SA18'!A19)","v":""}]
[{"$f":"'SA18'!A20","v":"  Other transfers/grants [insert description]"}]
[{"$f":"'SA18'!A21","v":"District Municipality:"},null,{"$f":"SUM(C22:C23)","v":1476728},{"$f":"SUM(D22:D23)","v":0},0,0,0,0,0,0,0]
[{"$f":"'SA18'!A22","v":"fezile Dabi District Municipality"},null,1476728]
[]
[{"$f":"'SA18'!A24","v":"Other grant providers:"},null,{"$f":"SUM(C25:C26)","v":0},{"$f":"SUM(D25:D26)","v":0},0,0,0,0,0,0,0]
[{"$f":"'SA18'!A25","v":"  [insert description]"}]
[]
["Total operating expenditure of Transfers and Grants:",null,{"$f":"C7+C15+C21+C24","v":77001187},84146369,86425455,81524000,87524000,0,83172000,90157000,95121000]
[]
["Capital expenditure of Transfers and Grants"]
[{"$f":"'SA18'!A30","v":"National Government:"},null,{"$f":"SUM(C31:C37)","v":21319361},{"$f":"SUM(D31:D37)","v":0},0,32422000,32422000,0,32080000,30874000,37037000]
[" Municipal Infrastructure Grant (MIG)",null,14947283,null,null,21422000,21422000,null,27080000,23874000,25037000]
[""]
[""]
[""]
["Departmen of Water Affairs",null,2145866]
["Energy Efficiency Demand Management Grant",null,4226212,null,null,5000000,5000000]
["Integrated National Electrification Grant",null,null,null,null,6000000,6000000,null,5000000,7000000,12000000]
[{"$f":"'SA18'!A38","v":"Provincial Government:"},null,{"$f":"SUM(C39)","v":0},{"$f":"SUM(D39)","v":0},0,0,0,0,0,0,0]
[{"$f":"'SA18'!A39","v":"Other capital transfers/grants [insert description]"}]
[{"$f":"'SA18'!A40","v":"District Municipality:"},null,{"$f":"SUM(C41:C42)","v":0},{"$f":"SUM(D41:D42)","v":0},0,0,0,0,0,0,0]
[{"$f":"'SA18'!A41","v":"fezile Dabi District Municipality"}]
[]
[{"$f":"'SA18'!A43","v":"Other grant providers:"},null,{"$f":"SUM(C44:C45)","v":0},{"$f":"SUM(D44:D45)","v":0},0,0,0,0,0,0,0]
[{"$f":"'SA18'!A44","v":"  [insert description]"}]
[]
["Total capital expenditure of Transfers and Grants",null,{"$f":"C30+C38+C40+C43","v":21319361},{"$f":"D30+D38+D40+D43","v":0},0,32422000,32422000,0,32080000,30874000,37037000]
[]
["TOTAL EXPENDITURE OF TRANSFERS AND GRANTS",null,{"$f":"C27+C46","v":98320548},84146369,86425455,113946000,119946000,0,115252000,121031000,132158000]
[{"$f":"head27a","v":"References"}]
["1. Expenditure must be separately listed for each transfer or grant received or recognised"]

{"sheet":"SA20","index":40,"n_rows":60,"n_cols":11,"rows_kept":60,"cut":false,"hidden":false,"merged":[[56,0,56,10],[1,5,1,7],[1,8,1,10],[54,0,54,10],[55,0,55,10]]}
[{"$f":"muni&\" - \"& TableA20","v":"FS205 Mafube - Supporting Table SA20 Reconciliation of transfers, grant receipts and unspent funds"}]
[{"$f":"desc","v":"Description"},{"$f":"head27","v":"Ref"},{"$f":"head1b","v":"2013/14"},{"$f":"head1A","v":"2014/15"},{"$f":"Head1","v":"2015/16"},{"$f":"Head2","v":"Current Year 2016/17"},null,null,{"$f":"Head3","v":"2017/18 Medium Term Revenue & Expenditure Framework"}]
["R thousand",null,{"$f":"Head5","v":"Audited Outcome"},{"$f":"Head5","v":"Audited Outcome"},{"$f":"Head5","v":"Audited Outcome"},{"$f":"Head6","v":"Original Budget"},{"$f":"Head7","v":"Adjusted Budget"},{"$f":"Head8","v":"Full Year Forecast"},{"$f":"Head9","v":"Budget Year 2017/18"},{"$f":"Head10","v":"Budget Year +1 2018/19"},{"$f":"Head11","v":"Budget Year +2 2019/20"}]
["Operating transfers and grants:","1,3"]
[{"$f":"'SA18'!A7","v":"National Government:"}]
["Balance unspent at beginning of the year"]
["Current year receipts",null,2540000]
["Conditions met - transferred to revenue",null,{"$f":"C6+C7-C9","v":2540000},{"$f":"D6+D7-D9","v":0},0,0,0,0,0,0,0]
["Conditions still to be met - transferred to liabilities"]
["Provincial Government:"]
["Balance unspent at beginning of the year",null,889380]
[{"$f":"A7","v":"Current year receipts"},null,5538858]
[{"$f":"A8","v":"Conditions met - transferred to revenue"},null,{"$f":"C11+C12-C14","v":5185415},0,0,0,0,0,0,0,0]
[{"$f":"A9","v":"Conditions still to be met - transferred to liabilities"},null,1242823]
["District Municipality:"]
[{"$f":"A11","v":"Balance unspent at beginning of the year"}]
[{"$f":"A12","v":"Current year receipts"},null,1476728]
[{"$f":"A13","v":"Conditions met - transferred to revenue"},null,{"$f":"C16+C17-C19","v":1476728},0,0,0,0,0,0,0,0]
[{"$f":"A14","v":"Conditions still to be met - transferred to liabilities"}]
["Other grant providers:"]
[{"$f":"A11","v":"Balance unspent at beginning of the year"},null,12154876]
[{"$f":"A12","v":"Current year receipts"},null,29532700]
[{"$f":"A13","v":"Conditions met - transferred to revenue"},null,{"$f":"C21+C22-C24","v":21319361},0,0,0,0,0,0,0,0]
[{"$f":"A14","v":"Conditions still to be met - transferred to liabilities"},null,20368215]
["Total operating transfers and grants revenue",null,{"$f":"C8+C13+C18+C23","v":30521504},0,0,0,0,0,0,0,0]
["Total operating transfers and grants - CTBM",2,21611038,0,0,0,0,0,0,0,0]
[]
["Capital transfers and grants:","1,3"]
[{"$f":"A5","v":"National Government:"}]
["Balance unspent at beginning of the year"]
["Current year receipts"]
["Conditions met - transferred to revenue",null,{"$f":"C30+C31-C33","v":0},0,0,0,0,0,0,0,0]
["Conditions still to be met - transferred to liabilities"]
["Provincial Government:"]
["Balance unspent at beginning of the year"]
[{"$f":"A31","v":"Current year receipts"}]
[{"$f":"A32","v":"Conditions met - transferred to revenue"},null,{"$f":"C35+C36-C38","v":0},0,0,0,0,0,0,0,0]
[{"$f":"A33","v":"Conditions still to be met - transferred to liabilities"}]
["District Municipality:"]
[{"$f":"A35","v":"Balance unspent at beginning of the year"}]
[{"$f":"A36","v":"Current year receipts"}]
[{"$f":"A37","v":"Conditions met - transferred to revenue"},null,{"$f":"C40+C41-C43","v":0},0,0,0,0,0,0,0,0]
[{"$f":"A38","v":"Conditions still to be met - transferred to liabilities"}]
["Other grant providers:"]
[{"$f":"A35","v":"Balance unspent at beginning of the year"}]
[{"$f":"A36","v":"Current year receipts"}]
[{"$f":"A37","v":"Conditions met - transferred to revenue"},null,{"$f":"C45+C46-C48","v":0},0,0,0,0,0,0,0,0]
[{"$f":"A38","v":"Conditions still to be met - transferred to liabilities"}]
["Total capital transfers and grants revenue",null,{"$f":"C32+C37+C42+C47","v":0},0,0,0,0,0,0,0,0]
["Total capital transfers and grants - CTBM",2,0,0,0,0,0,0,0,0,0]
[]
["TOTAL TRANSFERS AND GRANTS REVENUE",null,{"$f":"C25+C49","v":30521504},0,0,0,0,0,0,0,0]
["TOTAL TRANSFERS AND GRANTS - CTBM",null,{"$f":"C26+C50","v":21611038},{"$f":"D26+D50","v":0},0,0,0,0,0,0,0]
[{"$f":"head27a","v":"References"}]
["1. Total capital transfers and grants revenue must reconcile to Budgeted Financial Performance and Financial Position; total recurrent grants revenue must reconcile to Budgeted Financial Performance"]
["2. CTBM = conditions to be met"]
["3. National Treasury database will require this reconciliation for each transfer/grant"]
[]
["Check opex",null,{"$f":"C25-'A4-FinPerf RE'!C19","v":-45002955},{"$f":"D25-'A4-FinPerf RE'!D19","v":-83705052},{"$f":"E25-'A4-FinPerf RE'!E19","v":-86948674},{"$f":"F25-'A4-FinPerf RE'!F19","v":-81524000},{"$f":"G25-'A4-FinPerf RE'!G19","v":-87524000},{"$f":"H25-'A4-FinPerf RE'!H19","v":-81524000},{"$f":"I25-'A4-FinPerf RE'!J19","v":-83172000},{"$f":"J25-'A4-FinPerf RE'!K19","v":-90157000},{"$f":"K25-'A4-FinPerf RE'!L19","v":-95121000}]
["Check capex",null,{"$f":"C49-'A5-Capex'!C70","v":-23341792},{"$f":"D49-'A5-Capex'!D70","v":-12656687},{"$f":"E49-'A5-Capex'!E70","v":-8051791},{"$f":"F49-'A5-Capex'!F70","v":-31941635},{"$f":"G49-'A5-Capex'!G70","v":-31941635},{"$f":"H49-'A5-Capex'!H70","v":-31941635},{"$f":"I49-'A5-Capex'!J70","v":-31091912.760000002},{"$f":"J49-'A5-Capex'!K70","v":-29873991.890000001},{"$f":"K49-'A5-Capex'!L70","v":-36024827.364027761}]

{"sheet":"SA21","index":41,"n_rows":71,"n_cols":12,"rows_kept":71,"cut":false,"hidden":false,"merged":[[1,9,1,11],[1,5,1,8]]}
[{"$f":"muni&\" - \"& TableA21","v":"FS205 Mafube - Supporting Table SA21 Transfers and grants made by the municipality"}]
[{"$f":"desc","v":"Description"},{"$f":"head27","v":"Ref"},{"$f":"head1b","v":"2013/14"},{"$f":"head1A","v":"2014/15"},{"$f":"Head1","v":"2015/16"},{"$f":"Head2","v":"Current Year 2016/17"},null,null,null,{"$f":"Head3","v":"2017/18 Medium Term Revenue & Expenditure Framework"}]
["R thousand",null,{"$f":"Head5","v":"Audited Outcome"},{"$f":"Head5","v":"Audited Outcome"},{"$f":"Head5","v":"Audited Outcome"},{"$f":"Head6","v":"Original Budget"},{"$f":"Head7","v":"Adjusted Budget"},{"$f":"Head8","v":"Full Year Forecast"},{"$f":"Head5b","v":"Pre-audit outcome"},{"$f":"Head9","v":"Budget Year 2017/18"},{"$f":"Head10","v":"Budget Year +1 2018/19"},{"$f":"Head11","v":"Budget Year +2 2019/20"}]
[]
["Cash Transfers to other municipalities"]
["Insert description",1]
[]
[]
["Total Cash Transfers To Municipalities:",null,{"$f":"SUM(C6:C8)","v":0},{"$f":"SUM(D6:D8)","v":0},0,0,0,0,0,0,0,0]
[]
["Cash Transfers to Entities/Other External Mechanisms"]
[{"$f":"$A$6","v":"Insert description"},2]
[]
[]
["Total Cash Transfers To Entities/Ems'",null,{"$f":"SUM(C12:C14)","v":0},{"$f":"SUM(D12:D14)","v":0},0,0,0,0,0,0,0,0]
[]
["Cash Transfers to other Organs of State"]
[{"$f":"$A$6","v":"Insert description"},3]
[]
[]
["Total Cash Transfers To Other Organs Of State:",null,{"$f":"SUM(C18:C20)","v":0},{"$f":"SUM(D18:D20)","v":0},0,0,0,0,0,0,{"$f":"SUM(K18:K20)","v":0},0]
[]
["Cash Transfers to Organisations"]
[{"$f":"$A$6","v":"Insert description"}]
[]
["Total Cash Transfers To Organisations",null,{"$f":"SUM(C24:C25)","v":0},0,0,0,0,0,0,0,0,0]
[]
["Cash Transfers to Groups of Individuals"]
[{"$f":"$A$6","v":"Insert description"}]
[]
["Total Cash Transfers To Groups Of Individuals:",null,{"$f":"SUM(C29:C30)","v":0},0,0,0,0,0,0,0,0,0]
["TOTAL CASH TRANSFERS AND GRANTS",6,{"$f":"C9+C15+C21+C26+C31","v":0},0,0,0,0,0,0,0,0,0]
[]
["Non-Cash Transfers to other municipalities"]
["Insert description",1]
[]
[]
["Total Non-Cash Transfers To Municipalities:",null,{"$f":"SUM(C35:C37)","v":0},{"$f":"SUM(D35:D37)","v":0},0,0,0,0,0,0,0,0]
[]
["Non-Cash Transfers to Entities/Other External Mechanisms"]
[{"$f":"$A$6","v":"Insert description"},2]
[]
[]
["Total Non-Cash Transfers To Entities/Ems'",null,{"$f":"SUM(C41:C43)","v":0},{"$f":"SUM(D41:D43)","v":0},0,0,0,0,0,0,0,0]
[]
["Non-Cash Transfers to other Organs of State"]
[{"$f":"$A$6","v":"Insert description"},3]
[]
[]
["Total Non-Cash Transfers To Other Organs Of State:",null,{"$f":"SUM(C47:C49)","v":0},{"$f":"SUM(D47:D49)","v":0},0,0,0,0,0,0,{"$f":"SUM(K47:K49)","v":0},{"$f":"SUM(L47:L49)","v":0}]
[]
["Non-Cash Grants to Organisations"]
[{"$f":"$A$6","v":"Insert description"},4]
[]
[]
["Total Non-Cash Grants To Organisations",null,{"$f":"SUM(C53:C55)","v":0},{"$f":"SUM(D53:D55)","v":0},0,0,0,0,0,0,{"$f":"SUM(K53:K55)","v":0},{"$f":"SUM(L53:L55)","v":0}]
[]
["Groups of Individuals"]
["Indigent Households",5,6746501,3547907,9595124,5252545,5252545,5252545,0,10000000,10610000,11257210]
[]
[]
["Total Non-Cash Grants To Groups Of Individuals:",null,{"$f":"SUM(C59:C61)","v":6746501},3547907,9595124,5252545,5252545,5252545,0,10000000,10610000,11257210]
["TOTAL NON-CASH TRANSFERS AND GRANTS",null,{"$f":"C38+C44+C50+C56+C62","v":6746501},3547907,9595124,5252545,5252545,5252545,0,10000000,10610000,11257210]
["TOTAL TRANSFERS AND GRANTS",6,{"$f":"C32+C63","v":6746501},{"$f":"D32+D63","v":3547907},9595124,5252545,5252545,5252545,0,10000000,10610000,11257210]
[{"$f":"head27a","v":"References"}]
["1. Insert description listed by municipal name and demarcation code of recipient"]
["2. Insert description of each entity or external mechanism (an external mechanism may be provided with resources to ensure a minimum level of service)"]
["3. Insert description of each Organ of State (e.g. transfer to electricity provider to compensate for FBS provided)"]
["4. Insert description of each other organisation (e.g. charity)"]
["5 Insert description of each other organisation (e.g. the aged, child-headed households)"]
["6. All descriptions should separate transfers for 'capital purposes' and 'operating purposes'"]

{"sheet":"SA22","index":42,"n_rows":120,"n_cols":11,"rows_kept":120,"cut":false,"hidden":false,"merged":[[1,5,1,7],[1,8,1,10]]}
[{"$f":"muni&\" - \"&TableA22","v":"FS205 Mafube - Supporting Table SA22 Summary councillor and staff benefits"}]
["Summary of Employee and Councillor remuneration",{"$f":"head27","v":"Ref"},{"$f":"head1b","v":"2013/14"},{"$f":"head1A","v":"2014/15"},{"$f":"Head1","v":"2015/16"},{"$f":"Head2","v":"Current Year 2016/17"},null,null,{"$f":"Head3","v":"2017/18 Medium Term Revenue & Expenditure Framework"}]
["R thousand",null,{"$f":"Head5","v":"Audited Outcome"},{"$f":"Head5","v":"Audited Outcome"},{"$f":"Head5","v":"Audited Outcome"},{"$f":"Head6","v":"Original Budget"},{"$f":"Head7","v":"Adjusted Budget"},{"$f":"Head8","v":"Full Year Forecast"},{"$f":"Head9","v":"Budget Year 2017/18"},{"$f":"Head10","v":"Budget Year +1 2018/19"},{"$f":"Head11","v":"Budget Year +2 2019/20"}]
[null,1,"A","B","C","D","E","F","G","H","I"]
["Councillors (Political Office Bearers plus Other)"]
["Basic Salaries and Wages",null,4749681,null,null,3326974.0553520005,3326974.0553520005,null,3360243.7959055207,3393846.2338645761,3427784.696203222]
["Pension and UIF Contributions",null,114358,null,null,489287.97257760004,489287.97257760004,null,494180.85230337607,499122.66082640982,504113.8874346739]
["Medical Aid Contributions",null,16532,null,null,67864.754793600005,67864.754793600005,null,68543.402341535999,69228.836364951363,69921.124728600873]
["Motor Vehicle Allowance",null,297760,null,null,1276308.2257344001,1276308.2257344001,null,1289071.307991744,1301962.0210716615,1314981.6412823782]
["Cellphone Allowance",null,46944,null,null,238259.75904000003,238259.75904000003,null,240642.35663040003,243048.78019670403,245479.26799867107]
["Housing Allowances"]
["Other benefits and allowances",null,9907,null,null,527321,527321,null,532594.21,537920.15209999995,543299.35362099996]
["Sub Total - Councillors",null,{"$f":"SUM(C6:C12)","v":5235182},0,0,5926015.767497601,5926015.767497601,0,5985275.9251725757,6045128.6844243025,6105579.9712685458]
["% increase",4,null,{"$f":"IF(ISERROR((D13/C13)-1),0,((D13/C13)-1))","v":-1},{"$f":"IF(ISERROR((E13/D13)-1),0,((E13/D13)-1))","v":0},0,0,-1,0,1.0000000000000231E-2,1.0000000000000009E-2]
[]
["Senior Managers of the Municipality",2]
["Basic Salaries and Wages",null,2998999,null,null,3450454.9130688002,2794868.4795857281,null,2822817.1643815855,2851045.3360254015,2879555.7893856554]
["Pension and UIF Contributions",null,543188,null,null,171102.79049280001,138593.260299168,null,139979.19290215967,141378.98483118127,142792.77467949307]
["Medical Aid Contributions",null,0,null,null,66280.609238400008,53687.293483104004,null,54224.166417935041,54766.408082114394,55314.072162935539]
["Overtime"]
["Performance Bonus"]
["Motor Vehicle Allowance",3,824164,null,null,844265.74855680007,683855.25633100804,null,690693.80889431818,697600.74698326131,704576.75445309398]
["Cellphone Allowance",3,null,null,null,10623.744000000001,8605.2326400000002,null,8691.2849664000005,8778.197816064001,8865.9797942246405]
["Housing Allowances",3]
["Other benefits and allowances",3,787648,null,null,1020065,833790,null,842127.9,850549.179,859054.67079]
["Payments in lieu of leave"]
["Long service awards"]
["Post-retirement benefit obligations",6]
["Sub Total - Senior Managers of Municipality",null,{"$f":"SUM(C17:C28)","v":5153999},{"$f":"SUM(D17:D28)","v":0},0,5562792.8053568006,4513399.5223390087,0,4558533.5175623987,4604118.8527380228,4650160.0412654029]
[{"$f":"$A$14","v":"% increase"},{"$f":"$B$14","v":4},null,{"$f":"IF(ISERROR((D29/C29)-1),0,((D29/C29)-1))","v":-1},{"$f":"IF(ISERROR((E29/D29)-1),0,((E29/D29)-1))","v":0},0,-0.18864504211036903,-1,0,1.0000000000000009E-2,1.0000000000000009E-2]
[]
["Other Municipal Staff"]
["Basic Salaries and Wages",null,60000000,null,null,47524225.084100008,52409259.941314653,null,50701148,51208161,51720243]
["Pension and UIF Contributions",null,null,null,null,9296145.0502750091,11969872.936005849,null,11491077,11605987.77,11722047.647700001]
["Medical Aid Contributions",null,null,null,null,4286787.2309370246,5017124.0181092601,null,4816439,4864603.3899999997,4913249.4238999998]
["Overtime",null,null,null,null,1503718.08,1751402.871925253,null,1681346,1698159.46,1715141.0545999999]
["Performance Bonus",null,null,null,null,0,0,null,null,0,0]
["Motor Vehicle Allowance",3,613278,null,null,3565730.9231184968,4909259.4993698904,null,4712889,4760017.8899999997,4807618.0688999994]
["Cellphone Allowance",3,null,null,null,80785.028973888009,97976.66076056796,null,94057,94997.57,95947.545700000002]
["Housing Allowances",3,null,null,null,37166.444641440001,43288.312317338721,null,41556,41971.56,42391.275600000001]
["Other benefits and allowances",3,3848683,null,null,15672529,8014120.0999999996,null,7693555,7770490.5499999998,7848195.4555000002]
["Payments in lieu of leave",null,null,null,null,null,0]
["Long service awards",null,null,null,null,null,0]
["Post-retirement benefit obligations",6,null,null,null,null,0]
["Sub Total - Other Municipal Staff",null,{"$f":"SUM(C33:C44)","v":64461961},0,0,81967086.842045873,84212304.339802802,0,81232067,82044389.189999983,82864833.471900001]
[{"$f":"$A$14","v":"% increase"},{"$f":"$B$14","v":4},null,{"$f":"IF(ISERROR((D45/C45)-1),0,((D45/C45)-1))","v":-1},{"$f":"IF(ISERROR((E45/D45)-1),0,((E45/D45)-1))","v":0},0,2.7391695670282434E-2,-1,0,1.0000018711822101E-2,1.0000004753524472E-2]
[]
["Total Parent Municipality",null,{"$f":"C13+C29+C45","v":74851142},0,0,93455895.414900273,94651719.629639417,0,91775876.442734972,92693636.727162302,93620573.484433949]
[null,null,null,{"$f":"IF(ISERROR((D48/C48)-1),0,((D48/C48)-1))","v":-1},{"$f":"IF(ISERROR((E48/D48)-1),0,((E48/D48)-1))","v":0},0,1.2795599565230686E-2,-1,0,1.0000016562086156E-2,1.0000004207408875E-2]
[]
["Board Members of Entities"]
["Basic Salaries and Wages"]
["Pension and UIF Contributions"]
["Medical Aid Contributions"]
["Overtime"]
["Performance Bonus"]
["Motor Vehicle Allowance",3]
["Cellphone Allowance",3]
["Housing Allowances",3]
["Other benefits and allowances",3]
["Board Fees"]
["Payments in lieu of leave"]
["Long service awards"]
["Post-retirement benefit obligations",6]
["Sub Total - Board Members of Entities",null,{"$f":"SUM(C52:C64)","v":0},{"$f":"SUM(D52:D64)","v":0},0,0,0,0,0,0,0]
[{"$f":"$A$14","v":"% increase"},{"$f":"$B$14","v":4},null,{"$f":"IF(ISERROR((D65/C65)-1),0,((D65/C65)-1))","v":0},{"$f":"IF(ISERROR((E65/D65)-1),0,((E65/D65)-1))","v":0},0,0,0,0,0,0]
[]
["Senior Managers of Entities"]
["Basic Salaries and Wages"]
["Pension and UIF Contributions"]
["Medical Aid Contributions"]
["Overtime"]
["Performance Bonus"]
["Motor Vehicle Allowance",3]
["Cellphone Allowance",3]
["Housing Allowances",3]
["Other benefits and allowances",3]
["Payments in lieu of leave"]
["Long service awards"]
["Post-retirement benefit obligations",6]
["Sub Total - Senior Managers of Entities",null,{"$f":"SUM(C69:C80)","v":0},{"$f":"SUM(D69:D80)","v":0},0,0,0,0,0,0,0]
[{"$f":"$A$14","v":"% increase"},{"$f":"$B$14","v":4},null,{"$f":"IF(ISERROR((D81/C81)-1),0,((D81/C81)-1))","v":0},{"$f":"IF(ISERROR((E81/D81)-1),0,((E81/D81)-1))","v":0},0,0,0,0,0,0]
[]
["Other Staff of Entities"]
["Basic Salaries and Wages"]
["Pension and UIF Contributions"]
["Medical Aid Contributions"]
["Overtime"]
["Performance Bonus"]
["Motor Vehicle Allowance",3]
["Cellphone Allowance",3]
["Housing Allowances",3]
["Other benefits and allowances",3]
["Payments in lieu of leave"]
["Long service awards"]
["Post-retirement benefit obligations",6]
["Sub Total - Other Staff of Entities",null,{"$f":"SUM(C85:C96)","v":0},{"$f":"SUM(D85:D96)","v":0},0,0,0,0,0,0,0]
[{"$f":"$A$14","v":"% increase"},{"$f":"$B$14","v":4},null,{"$f":"IF(ISERROR((D97/C97)-1),0,((D97/C97)-1))","v":0},{"$f":"IF(ISERROR((E97/D97)-1),0,((E97/D97)-1))","v":0},0,0,0,0,0,0]
[]
["Total Municipal Entities",null,{"$f":"C65+C81+C97","v":0},{"$f":"D65+D81+D97","v":0},0,0,0,0,0,0,0]
[]
["TOTAL SALARY, ALLOWANCES & BENEFITS",null,{"$f":"C48+C100","v":74851142},{"$f":"D48+D100","v":0},{"$f":"E48+E100","v":0},93455895.414900273,94651719.629639417,0,91775876.442734972,92693636.727162302,93620573.484433949]
[{"$f":"$A$14","v":"% increase"},{"$f":"$B$14","v":4},null,{"$f":"IF(ISERROR((D102/C102)-1),0,((D102/C102)-1))","v":-1},{"$f":"IF(ISERROR((E102/D102)-1),0,((E102/D102)-1))","v":0},0,1.2795599565230686E-2,-1,0,1.0000016562086156E-2,1.0000004207408875E-2]
["TOTAL MANAGERS AND STAFF","5,7",{"$f":"C29+C45+C81+C97","v":69615960},0,0,87529879.647402674,88725703.862141818,0,85790600.517562404,86648508.042738006,87514993.513165399]
[{"$f":"head27a","v":"References"}]
["1. Include 'Loans and advances' where applicable if any reportable amounts until phased compliance with s164 of MFMA achieved"]
["2. s57 of the Systems Act"]
["3. In kind benefits (e.g. provision of living quarters) must be shown as the cost (full market value) to the municipality, as part of the relevant allowance"]
["4. B/A, C/B, D/C, E/C, F/C, G/D, H/D, I/D"]
["5. Must agree to the sub-total appearing on Table A1 (Employee costs)"]
["6. Includes pension payments and employer contributions to medical aid"]
["7. Correct as at 30 June"]
[]
["Column Definitions:"]
["A, B and C. Audited actual as per the audited financial statements. If audited amounts are unavailable, unaudited amounts must be provided with a note stating these are unaudited"]
["D. The original budget approved by council for the budget year."]
["E. The budget for the budget year as adjusted by council resolution in terms of section 28 of the MFMA."]
["F. An estimate of final actual amounts (pre audit) for the current year at the point in time of preparing the budget for the budget year. This may differ from E."]
["G. The amount to be appropriated for the budget year."]
["H and I. The indicative projection"]

{"sheet":"SA23","index":43,"n_rows":70,"n_cols":9,"rows_kept":70,"cut":false,"hidden":false,"merged":[[1,2,2,2],[1,5,2,5],[1,3,2,3],[1,6,2,6]]}
[{"$f":"muni&\" - \"&TableA23","v":"FS205 Mafube - Supporting Table SA23 Salaries, allowances & benefits (political office bearers/councillors/senior managers)"}]
["Disclosure of Salaries, Allowances & Benefits 1.",{"$f":"head27","v":"Ref"},"No.","Salary","\nContributions\n","Allowances","Performance  Bonuses","In-kind benefits","Total Package"]
["Rand per annum",null,null,null,"1.",null,null,null,"2."]
["Councillors",3]
["Speaker",4,null,374733.04847040004,80159.866790400018,159619,null,null,{"$f":"SUM(D5:F5)","v":614511.91526080004}]
["Chief Whip",null,null,0,0,0,null,null,0]
["Executive Mayor",null,null,489201.76532160002,79665.331507199997,213502.32884160001,null,null,782369.42567040003]
["Deputy Executive Mayor",null,null,0,0,0,null,null,0]
["Executive Committee",null,null,437698.1421360001,36728.05363200001,193060.51902720003,null,null,667486.71479520015]
["Total for all other councillors",null,null,2025341.0994240004,292734.72064800002,1602833,null,null,3920908.8200720004]
[{"$f":"\"Total \"&A4","v":"Total Councillors"},8,{"$f":"SUM(C5:C10)","v":0},3326974.0553520005,489287.97257760004,2169014.8478688002,null,null,5985276.8757984005]
[]
["Senior Managers of the Municipality",5]
["Municipal Manager (MM)",null,null,null,null,null,null,null,{"$f":"SUM(D14:H14)","v":0}]
["Chief Finance Officer",null,null,753897.93039999995,52738.189599999998,166135,null,null,972771.12]
[null,null,null,953024.44240000006,41643.124799999998,222983.99999999988,null,null,1217651.5671999999]
[null,null,null,902081.51706880005,30951.884892800001,214243.99999999988,null,null,1147277.4019615999]
[null,null,null,591994.3968000001,30530.379199999999,139286,null,null,761810.77600000007]
[null,null,null,249456.62640000001,24328,185239.212,null,null,459023.83840000001]
[]
["List of each offical with packages >= senior manager"]
[null,null,null,null,null,null,null,null,{"$f":"SUM(D22:H22)","v":0}]
[null,null,null,null,null,null,null,null,{"$f":"SUM(D23:H23)","v":0}]
[null,null,null,null,null,null,null,null,0]
[null,null,null,null,null,null,null,null,0]
[null,null,null,null,null,null,null,null,0]
[null,null,null,null,null,null,null,null,0]
[null,null,null,null,null,null,null,null,0]
[null,null,null,null,null,null,null,null,0]
[null,null,null,null,null,null,null,null,0]
[null,null,null,null,null,null,null,null,0]
[null,null,null,null,null,null,null,null,0]
[null,null,null,null,null,null,null,null,{"$f":"SUM(D33:H33)","v":0}]
[null,null,null,null,null,null,null,null,{"$f":"SUM(D34:H34)","v":0}]
[{"$f":"\"Total \"&A13","v":"Total Senior Managers of the Municipality"},"8,10",{"$f":"SUM(C14:C34)","v":0},{"$f":"SUM(D14:D34)","v":3450454.9130688002},{"$f":"SUM(E14:E34)","v":180191.57849280001},{"$f":"SUM(F14:F34)","v":927888.21199999982},{"$f":"SUM(G14:G34)","v":0},null,{"$f":"SUM(I14:I34)","v":4558534.7035616003}]
[]
["A Heading for Each Entity","6,7"]
["List each member of board by designation"]
[null,null,null,null,null,null,null,null,{"$f":"SUM(D39:G39)","v":0}]
[null,null,null,null,null,null,null,null,{"$f":"SUM(D40:G40)","v":0}]
[null,null,null,null,null,null,null,null,0]
[null,null,null,null,null,null,null,null,0]
[null,null,null,null,null,null,null,null,0]
[null,null,null,null,null,null,null,null,0]
[null,null,null,null,null,null,null,null,0]
[null,null,null,null,null,null,null,null,0]
[null,null,null,null,null,null,null,null,0]
[null,null,null,null,null,null,null,null,0]
[null,null,null,null,null,null,null,null,0]
[null,null,null,null,null,null,null,null,0]
[null,null,null,null,null,null,null,null,0]
[null,null,null,null,null,null,null,null,0]
[null,null,null,null,null,null,null,null,0]
[null,null,null,null,null,null,null,null,0]
["Total for municipal entities","8,10",{"$f":"SUM(C38:C54)","v":0},{"$f":"SUM(D39:D54)","v":0},0,0,0,null,0]
[]
["TOTAL COST OF COUNCILLOR, DIRECTOR and EXECUTIVE REMUNERATION",10,{"$f":"C11+C35+C55","v":0},6777428.9684208008,669479.55107040005,3096903.0598688,0,null,10543811.579360001]
[]
[{"$f":"head27a","v":"References"}]
["1. Pension and medical aid"]
["2. Total package must equal the total cost to the municipality"]
["3. List each political office bearer by designation. Provide a total for all other councillors"]
["4. Political office bearer is defined in MFMA s 1: speaker, executive mayor, deputy executive mayor, member of executive committee,"]
["    mayor, deputy mayor, member of mayoral committee, the councillor designated to exercise powers and duties of mayor (MSA s 57)"]
["5. Also list each senior manager reporting to MM by designation and each official with package >= senior manager by designation"]
["6. List each entity where municipality has an interest and state percentage ownership and control"]
["7. List each senior manager reporting to the CEO of an Entity by designation"]
["8. Must reconcile to relevant section of Table SA24"]
["9. Must reconcile to totals shown for the budget year of Table SA22"]
["10. Correct as at 30 June"]

{"sheet":"SA24","index":44,"n_rows":53,"n_cols":11,"rows_kept":53,"cut":false,"hidden":false,"merged":[[1,5,1,7],[1,8,1,10],[1,2,1,4]]}
[{"$f":"muni&\" - \"&TableA24","v":"FS205 Mafube - Supporting Table SA24 Summary of personnel numbers"}]
["Summary of Personnel Numbers",{"$f":"head27","v":"Ref"},{"$f":"Head1","v":"2015/16"},null,null,{"$f":"Head2","v":"Current Year 2016/17"},null,null,{"$f":"Head9","v":"Budget Year 2017/18"}]
["Number","1,2","Positions","Permanent employees","Contract employees","Positions","Permanent employees","Contract employees","Positions","Permanent employees","Contract employees"]
["Municipal Council and Boards of Municipal Entities"]
["Councillors (Political Office Bearers plus Other Councillors)",null,17,null,17,17,null,17,17,null,17]
["Board Members of municipal entities",4]
["Municipal employees",5]
["Municipal Manager and Senior Managers",3,4,null,4,4,null,4,5,null,5]
["Other Managers",7,20,17,3,19,16,3,18,15,3]
["Professionals",null,{"$f":"SUM(C11:C19)","v":45},{"$f":"SUM(D11:D19)","v":45},0,45,45,0,45,45,0]
["Finance",null,35,35,null,35,35,null,35,35]
["Spatial/town planning",null,8,8,null,8,8,null,8,8]
["Information Technology",null,2,2,null,2,2,null,2,2]
["Roads"]
["Electricity"]
["Water"]
["Sanitation"]
["Refuse"]
["Other"]
["Technicians",null,{"$f":"SUM(C21:C29)","v":333},{"$f":"SUM(D21:D29)","v":333},0,325,325,0,325,325,0]
["Finance"]
["Spatial/town planning"]
["Information Technology"]
["Roads",null,44,44,null,41,41,null,41,41]
["Electricity",null,14,14,null,14,14,null,14,14]
["Water",null,49,49,null,47,47,null,47,47]
["Sanitation",null,72,72,null,70,70,null,70,70]
["Refuse",null,122,122,null,121,121,null,121,121]
["Other",null,32,32,null,32,32,null,32,32]
["Clerks (Clerical and administrative)",null,93,93,null,54,54,null,54,54]
["Service and sales workers"]
["Skilled agricultural and fishery workers"]
["Craft and related trades"]
["Plant and Machine Operators"]
["Elementary Occupations"]
["TOTAL PERSONNEL NUMBERS",9,{"$f":"SUM(C5:C9)+SUM(C11:C19)+SUM(C21:C35)","v":512},{"$f":"SUM(D5:D9)+SUM(D11:D19)+SUM(D21:D35)","v":488},24,464,440,{"$f":"SUM(H5:H9)+SUM(H11:H19)+SUM(H21:H35)","v":24},464,439,25]
["% increase",null,null,null,null,{"$f":"IF(ISERROR((F36/C36)-1),0,((F36/C36)-1))","v":-9.375E-2},-9.8360655737704916E-2,0,0,-2.2727272727273151E-3,4.1666666666666741E-2]
[]
["Total municipal employees headcount","6, 10"]
["Finance personnel headcount","8, 10"]
["Human Resources personnel headcount","8, 10"]
[]
[{"$f":"head27a","v":"References"}]
["1. Positions must be funded and aligned to the municipality's current organisational structure"]
["2. Full Time Equivalent (FTE). E.g. One full time person = 1FTE. A person working half time (say 4 hours out of 8) = 0.5FTE."]
["3. s57 of the Systems Act"]
["4. Include only in Consolidated Statements"]
["5. Include municipal entity employees in Consolidated Statements"]
["6.  Include headcount (number fo persons, Not FTE) of managers and staff only (exclude councillors)"]
["7. Managers who provide the direction of a critical technical function"]
["8. Total number of employees working on these functions"]
["9. Correct as at 30 June"]
["10. Must account for all budgeted positions, as per the municipal organogram"]

{"sheet":"SA25","index":45,"n_rows":49,"n_cols":17,"rows_kept":49,"cut":false,"hidden":false,"merged":[[1,2,1,13],[1,14,1,16]]}
[{"$f":"muni&\" - \"& TableA25","v":"FS205 Mafube - Supporting Table SA25 Budgeted monthly revenue and expenditure"}]
[{"$f":"desc","v":"Description"},{"$f":"head27","v":"Ref"},{"$f":"Head9","v":"Budget Year 2017/18"},null,null,null,null,null,null,null,null,null,null,null,"Medium Term Revenue and Expenditure Framework"]
["R thousand",null,"July","August","Sept.","October","November","December","January","February","March","April","May","June",{"$f":"Head9","v":"Budget Year 2017/18"},{"$f":"Head10","v":"Budget Year +1 2018/19"},{"$f":"Head11","v":"Budget Year +2 2019/20"}]
[{"$f":"'A4-FinPerf RE'!A4","v":"Revenue By Source"}]
[{"$f":"'A4-FinPerf RE'!A5","v":"Property rates"},null,2049543,2364536,2635475,1978697,1786978,2574758,2019203,1908980,2019302,2867586,1879687,{"$f":"O5-SUM(C5:M5)","v":4720227.9902600013},{"$f":"'A4-FinPerf RE'!J5","v":28804972.990260001},{"$f":"'A4-FinPerf RE'!K5","v":30562076.3426659},{"$f":"'A4-FinPerf RE'!L5","v":32426362.9995685}]
[{"$f":"'A4-FinPerf RE'!A6","v":"Property rates - penalties & collection charges"},null,null,null,null,null,null,null,null,null,null,null,null,0,{"$f":"'A4-FinPerf RE'!J6","v":0},{"$f":"'A4-FinPerf RE'!K6","v":0},{"$f":"'A4-FinPerf RE'!L6","v":0}]
[{"$f":"'A4-FinPerf RE'!A7","v":"Service charges - electricity revenue"},null,null,null,null,null,null,null,null,null,null,null,null,0,{"$f":"'A4-FinPerf RE'!J7","v":0},{"$f":"'A4-FinPerf RE'!K7","v":0},{"$f":"'A4-FinPerf RE'!L7","v":0}]
[{"$f":"'A4-FinPerf RE'!A8","v":"Service charges - water revenue"},null,2793000,1973000,1685000,1568000,2300000,1968000,1177000,2793283.7,2098216,1682874.7,1798000,2671409.9387800023,{"$f":"'A4-FinPerf RE'!J8","v":24507784.338780001},{"$f":"'A4-FinPerf RE'!K8","v":26002759.183445599},{"$f":"'A4-FinPerf RE'!L8","v":27588927.4936358}]
[{"$f":"'A4-FinPerf RE'!A9","v":"Service charges - sanitation revenue"},null,2698000,1689000,1569000,2578000,1300000,890000,1170169.1100000001,1122372.1100000001,2051158.11,1119463.1100000001,1685321.11,988015.16496000439,{"$f":"'A4-FinPerf RE'!J9","v":18860498.714960001},{"$f":"'A4-FinPerf RE'!K9","v":20010989.136572599},{"$f":"'A4-FinPerf RE'!L9","v":21231659.4739035}]
[{"$f":"'A4-FinPerf RE'!A10","v":"Service charges - refuse revenue"},null,1538000,890000,750000,1116000,798000,1256000,1026405.7,1006001.7,1006000,1114193.7,1115194.7,2078347.7743200008,{"$f":"'A4-FinPerf RE'!J10","v":13694143.57432},{"$f":"'A4-FinPerf RE'!K10","v":14529486.332353501},{"$f":"'A4-FinPerf RE'!L10","v":15415784.9986271}]
[{"$f":"'A4-FinPerf RE'!A11","v":"Service charges - other"},null,null,null,null,null,null,null,null,null,null,null,null,0,{"$f":"'A4-FinPerf RE'!J11","v":0},{"$f":"'A4-FinPerf RE'!K11","v":0},{"$f":"'A4-FinPerf RE'!L11","v":0}]
[{"$f":"'A4-FinPerf RE'!A12","v":"Rental of facilities and equipment"},null,23521,24151,23223,24525,28745,29451,28414,27415,23223,23223,23521,29805.371886799985,{"$f":"'A4-FinPerf RE'!J12","v":309217.37188679999},{"$f":"'A4-FinPerf RE'!K12","v":328079.63157189498},{"$f":"'A4-FinPerf RE'!L12","v":348092.48909778002}]
[{"$f":"'A4-FinPerf RE'!A13","v":"Interest earned - external investments"},null,32122,12000,2415,8796,32512,15212,15445,17545,11233,23525,35464,7973.9628000000084,{"$f":"'A4-FinPerf RE'!J13","v":214242.96280000001},{"$f":"'A4-FinPerf RE'!K13","v":227311.78353079999},{"$f":"'A4-FinPerf RE'!L13","v":241177.80232617899}]
[{"$f":"'A4-FinPerf RE'!A14","v":"Interest earned - outstanding debtors"},null,2978695,1869785,2968594,1867585,2079786,2089708,1968594,1968594,2756475,1968594,2035243,2861225.2802879997,{"$f":"'A4-FinPerf RE'!J14","v":27412878.280288},{"$f":"'A4-FinPerf RE'!K14","v":29057650.977105301},{"$f":"'A4-FinPerf RE'!L14","v":30801110.035731599}]
[{"$f":"'A4-FinPerf RE'!A15","v":"Dividends received"},null,295000,295000,295000,295000,295000,295000,295000,295000,295000,295000,295000,301177.81725999992,{"$f":"'A4-FinPerf RE'!J15","v":3546177.8172599999},{"$f":"'A4-FinPerf RE'!K15","v":3762494.6641128599},{"$f":"'A4-FinPerf RE'!L15","v":3992006.8386237398}]
[{"$f":"'A4-FinPerf RE'!A16","v":"Fines"},null,6250,6250,6250,6250,6250,6250,6250,6250,6250,6250,6250,6250,{"$f":"'A4-FinPerf RE'!J16","v":75000},{"$f":"'A4-FinPerf RE'!K16","v":0},{"$f":"'A4-FinPerf RE'!L16","v":0}]
[{"$f":"'A4-FinPerf RE'!A17","v":"Licences and permits"},null,null,null,null,null,null,null,null,null,null,null,null,0,{"$f":"'A4-FinPerf RE'!J17","v":0},{"$f":"'A4-FinPerf RE'!K17","v":0},{"$f":"'A4-FinPerf RE'!L17","v":0}]
[{"$f":"'A4-FinPerf RE'!A18","v":"Agency services"},null,null,null,null,null,null,null,null,null,null,null,null,0,{"$f":"'A4-FinPerf RE'!J18","v":0},{"$f":"'A4-FinPerf RE'!K18","v":0},{"$f":"'A4-FinPerf RE'!L18","v":0}]
[{"$f":"'A4-FinPerf RE'!A19","v":"Transfers recognised - operational"},null,32978697,1875000,930000,null,24079607,null,null,null,21660696,null,null,1648000,{"$f":"'A4-FinPerf RE'!J19","v":83172000},{"$f":"'A4-FinPerf RE'!K19","v":90157000},{"$f":"'A4-FinPerf RE'!L19","v":95121000}]
[{"$f":"'A4-FinPerf RE'!A20","v":"Other revenue"},null,176758,176758,493059,176758,160800,176758,395848,176758,182747,176758,186978,52408.857737999875,{"$f":"'A4-FinPerf RE'!J20","v":2532388.8577379999},{"$f":"'A4-FinPerf RE'!K20","v":2686864.5780600202},{"$f":"'A4-FinPerf RE'!L20","v":2850763.31732168}]
[{"$f":"'A4-FinPerf RE'!A21","v":"Gains on disposal of PPE"},null,null,null,null,null,null,null,null,null,null,null,null,0,{"$f":"'A4-FinPerf RE'!J21","v":0},{"$f":"'A4-FinPerf RE'!K21","v":0},{"$f":"'A4-FinPerf RE'!L21","v":0}]
[{"$f":"'A4-FinPerf RE'!A22","v":"Total Revenue (excluding capital transfers and contributions)"},null,{"$f":"SUM(C5:C21)","v":45569586},11175480,11358016,9619611,32867678,9301137,8102328.8100000005,9322199.5100000016,32110300.109999999,9277467.5100000016,9060658.8100000005,15364842.158292808,203129304.9082928,217324712.62941849,230016885.44883588]
[]
[{"$f":"'A4-FinPerf RE'!A24","v":"Expenditure By Type"}]
[{"$f":"'A4-FinPerf RE'!A25","v":"Employee related costs"},null,7149216.8670176677,7149216.8670176677,7149216.8670176677,7149216.8670176677,7149216.8670176677,7149216.8670176677,7149216.8670176677,7149216.8670176677,7149216.8670176677,7149216.8670176677,7149216.8670176677,{"$f":"O25-SUM(C25:M25)","v":7149214.9803680331},{"$f":"'A4-FinPerf RE'!J25","v":85790600.517562404},{"$f":"'A4-FinPerf RE'!K25","v":86648508.04273802},{"$f":"'A4-FinPerf RE'!L25","v":87514993.513165414}]
[{"$f":"'A4-FinPerf RE'!A26","v":"Remuneration of councillors"},null,498773,498773,498773,498773,498773,498773,498773,498773,498773,498773,498773,498773.60440000053,{"$f":"'A4-FinPerf RE'!J26","v":5985276.6044000005},{"$f":"'A4-FinPerf RE'!K26","v":6045129.3704440007},{"$f":"'A4-FinPerf RE'!L26","v":6105580.6641484406}]
[{"$f":"'A4-FinPerf RE'!A27","v":"Debt impairment"},null,null,null,null,null,null,null,null,null,null,null,null,6569356,{"$f":"'A4-FinPerf RE'!J27","v":6569356},{"$f":"'A4-FinPerf RE'!K27","v":6970086.716},{"$f":"'A4-FinPerf RE'!L27","v":7395262.0056759994}]
[{"$f":"'A4-FinPerf RE'!A28","v":"Depreciation & asset impairment"},null,null,null,null,null,null,null,null,null,null,null,null,38259177,{"$f":"'A4-FinPerf RE'!J28","v":38259177},{"$f":"'A4-FinPerf RE'!K28","v":38259177},{"$f":"'A4-FinPerf RE'!L28","v":38259177}]
[{"$f":"'A4-FinPerf RE'!A29","v":"Finance charges"},null,183423,183423,183423,183423,183423,183423,183423,183423,183423,183423,183423,1280419,{"$f":"'A4-FinPerf RE'!J29","v":3298072},{"$f":"'A4-FinPerf RE'!K29","v":3499254.39},{"$f":"'A4-FinPerf RE'!L29","v":3712708.91}]
[{"$f":"'A4-FinPerf RE'!A30","v":"Bulk purchases"},null,2000000,null,null,null,2000000,null,null,null,2000000,null,null,0,{"$f":"'A4-FinPerf RE'!J30","v":6000000},{"$f":"'A4-FinPerf RE'!K30","v":8122000},{"$f":"'A4-FinPerf RE'!L30","v":11416420}]
[{"$f":"'A4-FinPerf RE'!A31","v":"Other materials"},null,null,null,null,null,null,null,null,null,null,null,null,0,{"$f":"'A4-FinPerf RE'!J31","v":0},{"$f":"'A4-FinPerf RE'!K31","v":0},{"$f":"'A4-FinPerf RE'!L31","v":0}]
[{"$f":"'A4-FinPerf RE'!A32","v":"Contracted services"},null,null,null,null,null,null,null,null,null,null,null,null,0,{"$f":"'A4-FinPerf RE'!J32","v":0},{"$f":"'A4-FinPerf RE'!K32","v":0},{"$f":"'A4-FinPerf RE'!L32","v":0}]
[{"$f":"'A4-FinPerf RE'!A33","v":"Transfers and grants"},null,833333,833333,833333,833333,833333,833333,833333,833333,833333,833333,833333,833337,{"$f":"'A4-FinPerf RE'!J33","v":10000000},{"$f":"'A4-FinPerf RE'!K33","v":10610000},{"$f":"'A4-FinPerf RE'!L33","v":11257210}]
[{"$f":"'A4-FinPerf RE'!A34","v":"Other expenditure"},null,9898888,1504950,2049392,1069594,4343222,3645363,3647564,1020101,18079695,1765555,1787766,8816436.796649605,{"$f":"'A4-FinPerf RE'!J34","v":57628526.796649605},{"$f":"'A4-FinPerf RE'!K34","v":62976697.817026049},{"$f":"'A4-FinPerf RE'!L34","v":68746573.756993353}]
[{"$f":"'A4-FinPerf RE'!A35","v":"Loss on disposal of PPE"},null,null,null,null,null,null,null,null,null,null,null,null,0,{"$f":"'A4-FinPerf RE'!J35","v":0},{"$f":"'A4-FinPerf RE'!K35","v":0},{"$f":"'A4-FinPerf RE'!L35","v":0}]
[{"$f":"'A4-FinPerf RE'!A36","v":"Total Expenditure"},null,{"$f":"SUM(C25:C35)","v":20563633.867017668},{"$f":"SUM(D25:D35)","v":10169695.867017668},10714137.867017668,9734339.8670176677,15007967.867017668,12310108.867017668,12312309.867017668,9684846.8670176677,28744440.867017668,10430300.867017668,10452511.867017668,63406714.38141764,213531008.918612,223130853.33620808,234407925.84998319]
[]
[{"$f":"'A4-FinPerf RE'!A38","v":"Surplus/(Deficit)"},null,{"$f":"C22-C36","v":25005952.132982332},1005784.1329823323,643878.13298233226,-114728.86701766774,17859710.132982332,-3008971.8670176677,-4209981.0570176672,-362647.3570176661,3365859.2429823317,-1152833.3570176661,-1391853.0570176672,-48041872.223124832,-10401704.010319203,-5806140.706789583,-4391040.401147306]
[{"$f":"'A4-FinPerf RE'!A39","v":"Transfers recognised - capital"},null,333333,12231312,333333,333333,10201991,333333,333333,333333,6711033,333333,333333,{"$f":"O39-SUM(C39:M39)","v":269000},{"$f":"'A4-FinPerf RE'!J39","v":32080000},{"$f":"'A4-FinPerf RE'!K39","v":30874000},{"$f":"'A4-FinPerf RE'!L39","v":37037000}]
[{"$f":"'A4-FinPerf RE'!A40","v":"Contributions recognised - capital"},null,null,null,null,null,null,null,null,null,null,null,null,{"$f":"O40-SUM(C40:M40)","v":0},{"$f":"'A4-FinPerf RE'!J40","v":0},{"$f":"'A4-FinPerf RE'!K40","v":0},{"$f":"'A4-FinPerf RE'!L40","v":0}]
[{"$f":"'A4-FinPerf RE'!A41","v":"Contributed assets"},null,null,null,null,null,null,null,null,null,null,null,null,{"$f":"O41-SUM(C41:M41)","v":0},{"$f":"'A4-FinPerf RE'!J41","v":0},{"$f":"'A4-FinPerf RE'!K41","v":0},{"$f":"'A4-FinPerf RE'!L41","v":0}]
[{"$f":"'A4-FinPerf RE'!A42","v":"Surplus/(Deficit) after capital transfers & contributions"},null,{"$f":"C38+SUM(C39:C41)","v":25339285.132982332},13237096.132982332,977211.13298233226,218604.13298233226,28061701.132982332,-2675638.8670176677,-3876648.0570176672,-29314.357017666101,10076892.242982332,-819500.3570176661,-1058520.0570176672,-47772872.223124832,{"$f":"O38+SUM(O39:O41)","v":21678295.989680797},{"$f":"P38+SUM(P39:P41)","v":25067859.293210417},{"$f":"Q38+SUM(Q39:Q41)","v":32645959.598852694}]
[{"$f":"'A4-FinPerf RE'!A43","v":"Taxation"},null,null,null,null,null,null,null,null,null,null,null,null,{"$f":"O43-SUM(C43:M43)","v":0},{"$f":"'A4-FinPerf RE'!J43","v":0},{"$f":"'A4-FinPerf RE'!K43","v":0},{"$f":"'A4-FinPerf RE'!L43","v":0}]
[{"$f":"'A4-FinPerf RE'!A45","v":"Attributable to minorities"},null,null,null,null,null,null,null,null,null,null,null,null,{"$f":"O44-SUM(C44:M44)","v":0},{"$f":"'A4-FinPerf RE'!J45","v":0},{"$f":"'A4-FinPerf RE'!K45","v":0},{"$f":"'A4-FinPerf RE'!L45","v":0}]
[{"$f":"'A4-FinPerf RE'!A47","v":"Share of surplus/ (deficit) of associate"},null,null,null,null,null,null,null,null,null,null,null,null,{"$f":"O45-SUM(C45:M45)","v":0},{"$f":"'A4-FinPerf RE'!J47","v":0},{"$f":"'A4-FinPerf RE'!K47","v":0},{"$f":"'A4-FinPerf RE'!L47","v":0}]
[{"$f":"'A4-FinPerf RE'!A38","v":"Surplus/(Deficit)"},1,{"$f":"C42+SUM(C43:C45)","v":25339285.132982332},13237096.132982332,977211.13298233226,218604.13298233226,28061701.132982332,-2675638.8670176677,-3876648.0570176672,-29314.357017666101,10076892.242982332,-819500.3570176661,-1058520.0570176672,-47772872.223124832,{"$f":"O42+SUM(O43:O45)","v":21678295.989680797},{"$f":"P42+SUM(P43:P45)","v":25067859.293210417},{"$f":"Q42+SUM(Q43:Q45)","v":32645959.598852694}]
[{"$f":"head27a","v":"References"}]
["1. Surplus (Deficit) must reconcile with Budgeted Financial Performance"]
["check",null,null,null,null,null,null,null,null,null,null,null,null,null,{"$f":"O46-'A4-FinPerf RE'!J48","v":0},{"$f":"P46-'A4-FinPerf RE'!K48","v":0},{"$f":"Q46-'A4-FinPerf RE'!L48","v":0}]

{"sheet":"SA26","index":46,"n_rows":48,"n_cols":17,"rows_kept":48,"cut":false,"hidden":false,"merged":[[1,2,1,13],[1,14,1,16]]}
[{"$f":"muni&\" - \"&TableA26","v":"FS205 Mafube - Supporting Table SA26 Budgeted monthly revenue and expenditure (municipal vote)"}]
[{"$f":"desc","v":"Description"},{"$f":"head27","v":"Ref"},{"$f":"Head9","v":"Budget Year 2017/18"},null,null,null,null,null,null,null,null,null,null,null,"Medium Term Revenue and Expenditure Framework"]
["R thousand",null,"July","August","Sept.","October","November","December","January","February","March","April","May","June",{"$f":"Head9","v":"Budget Year 2017/18"},{"$f":"Head10","v":"Budget Year +1 2018/19"},{"$f":"Head11","v":"Budget Year +2 2019/20"}]
[{"$f":"'A3-FinPerf V'!A4","v":"Revenue by Vote"}]
[{"$f":"'A3-FinPerf V'!A5","v":"Vote 1 - OFFICE OF THE MAYOR"},null,null,null,null,null,null,null,null,null,null,null,null,{"$f":"O5-SUM(C5:M5)","v":0},{"$f":"'A3-FinPerf V'!I5","v":0},{"$f":"'A3-FinPerf V'!J5","v":0},{"$f":"'A3-FinPerf V'!K5","v":0}]
[{"$f":"'A3-FinPerf V'!A6","v":"Vote 2 - OFFICE OF THE SPEAKER"},null,null,null,null,null,null,null,null,null,null,null,null,0,{"$f":"'A3-FinPerf V'!I6","v":0},{"$f":"'A3-FinPerf V'!J6","v":0},{"$f":"'A3-FinPerf V'!K6","v":0}]
[{"$f":"'A3-FinPerf V'!A7","v":"Vote 3 - OFFICE OF THE MUNICIPAL MANAGER"},null,null,null,null,null,null,null,null,null,null,null,null,0,{"$f":"'A3-FinPerf V'!I7","v":0},{"$f":"'A3-FinPerf V'!J7","v":0},{"$f":"'A3-FinPerf V'!K7","v":0}]
[{"$f":"'A3-FinPerf V'!A8","v":"Vote 4 - COMMUNITY SERVICES"},null,968796,708970,1330998,999988,897828,1380796,960796,940392,1059970,1048584,1049585,2347441,{"$f":"'A3-FinPerf V'!I8","v":13694144},{"$f":"'A3-FinPerf V'!J8","v":14529486},{"$f":"'A3-FinPerf V'!K8","v":15415785}]
[{"$f":"'A3-FinPerf V'!A9","v":"Vote 5 - CORPORATE SERVICES"},null,null,null,null,null,null,null,null,null,null,null,null,0,{"$f":"'A3-FinPerf V'!I9","v":0},{"$f":"'A3-FinPerf V'!J9","v":0},{"$f":"'A3-FinPerf V'!K9","v":0}]
[{"$f":"'A3-FinPerf V'!A10","v":"Vote 6 - FINANCIAL SERVICES"},null,35409559,12298959,3307298,545086,33364336,2259358,1817714,3009924,30109435,2993301,3579768,17372139.908293009,{"$f":"'A3-FinPerf V'!I10","v":146066877.90829301},{"$f":"'A3-FinPerf V'!J10","v":156781478.62941799},{"$f":"'A3-FinPerf V'!K10","v":165780514.448836}]
[{"$f":"'A3-FinPerf V'!A11","v":"Vote 7 - INFRASTRUCTURE SERVICES"},null,3588665,6956383,4158403,4270703,5321371,2949503,3472825,2041208,3652627,2927890,1215050,{"$f":"O11-SUM(C11:M11)","v":34893655},{"$f":"'A3-FinPerf V'!I11","v":75448283},{"$f":"'A3-FinPerf V'!J11","v":76887748},{"$f":"'A3-FinPerf V'!K11","v":85857586}]
[{"$f":"'A3-FinPerf V'!A12","v":"Vote 8 - SERVICE DELIVERY AND PUBLIC SAFETY"},null,null,null,null,null,null,null,null,null,null,null,null,{"$f":"O12-SUM(C12:M12)","v":0},{"$f":"'A3-FinPerf V'!I12","v":0},{"$f":"'A3-FinPerf V'!J12","v":0},{"$f":"'A3-FinPerf V'!K12","v":0}]
[{"$f":"'A3-FinPerf V'!A13","v":"Vote 9 - [NAME OF VOTE 9]"},null,null,null,null,null,null,null,null,null,null,null,null,{"$f":"O13-SUM(C13:M13)","v":0},{"$f":"'A3-FinPerf V'!I13","v":0},{"$f":"'A3-FinPerf V'!J13","v":0},{"$f":"'A3-FinPerf V'!K13","v":0}]
[{"$f":"'A3-FinPerf V'!A14","v":"Vote 10 - [NAME OF VOTE 10]"},null,null,null,null,null,null,null,null,null,null,null,null,{"$f":"O14-SUM(C14:M14)","v":0},{"$f":"'A3-FinPerf V'!I14","v":0},{"$f":"'A3-FinPerf V'!J14","v":0},{"$f":"'A3-FinPerf V'!K14","v":0}]
[{"$f":"'A3-FinPerf V'!A15","v":"Vote 11 - [NAME OF VOTE 11]"},null,null,null,null,null,null,null,null,null,null,null,null,0,{"$f":"'A3-FinPerf V'!I15","v":0},{"$f":"'A3-FinPerf V'!J15","v":0},{"$f":"'A3-FinPerf V'!K15","v":0}]
[{"$f":"'A3-FinPerf V'!A16","v":"Vote 12 - [NAME OF VOTE 12]"},null,null,null,null,null,null,null,null,null,null,null,null,0,{"$f":"'A3-FinPerf V'!I16","v":0},{"$f":"'A3-FinPerf V'!J16","v":0},{"$f":"'A3-FinPerf V'!K16","v":0}]
[{"$f":"'A3-FinPerf V'!A17","v":"Vote 13 - [NAME OF VOTE 13]"},null,null,null,null,null,null,null,null,null,null,null,null,0,{"$f":"'A3-FinPerf V'!I17","v":0},{"$f":"'A3-FinPerf V'!J17","v":0},{"$f":"'A3-FinPerf V'!K17","v":0}]
[{"$f":"'A3-FinPerf V'!A18","v":"Vote 14 - [NAME OF VOTE 14]"},null,null,null,null,null,null,null,null,null,null,null,null,0,{"$f":"'A3-FinPerf V'!I18","v":0},{"$f":"'A3-FinPerf V'!J18","v":0},{"$f":"'A3-FinPerf V'!K18","v":0}]
[{"$f":"'A3-FinPerf V'!A19","v":"Vote 15 - [NAME OF VOTE 15]"},null,null,null,null,null,null,null,null,null,null,null,null,0,{"$f":"'A3-FinPerf V'!I19","v":0},{"$f":"'A3-FinPerf V'!J19","v":0},{"$f":"'A3-FinPerf V'!K19","v":0}]
[{"$f":"'A3-FinPerf V'!A20","v":"Total Revenue by Vote"},null,{"$f":"SUM(C5:C19)","v":39967020},19964312,8796699,{"$f":"SUM(F5:F19)","v":5815777},39583535,6589657,6251335,5991524,34822032,6969775,5844403,54613235.908293009,235209304.90829301,248198712.62941799,267053885.448836]
[]
[{"$f":"'A3-FinPerf V'!A22","v":"Expenditure by Vote to be appropriated"}]
[{"$f":"A5","v":"Vote 1 - OFFICE OF THE MAYOR"},null,304940,304940,304940,304940,304940,304940,304940,304940,304940,304940,304940,{"$f":"O23-SUM(C23:M23)","v":3780421.7160999998},{"$f":"'A3-FinPerf V'!I23","v":7134761.7160999998},{"$f":"'A3-FinPerf V'!J23","v":7468759.333261},{"$f":"'A3-FinPerf V'!K23","v":7822118.5765936095}]
["Vote 2 - OFFICE OF THE SPEAKER",null,807970,879696,802939,820102,805960,897080,805960,807960,798070,798070,607060,1188544.8258999996,{"$f":"'A3-FinPerf V'!I24","v":10019411.8259},{"$f":"'A3-FinPerf V'!J24","v":10189730.944159001},{"$f":"'A3-FinPerf V'!K24","v":10366030.87860059}]
["Vote 3 - OFFICE OF THE MUNICIPAL MANAGER",null,3047333,4047333,4047333,4047333,3047333,4047333,4047333,4047333,3047333,4047333,4047333,4080479.419412002,{"$f":"'A3-FinPerf V'!I25","v":45601142.419412002},{"$f":"'A3-FinPerf V'!J25","v":46470153.843606114},{"$f":"'A3-FinPerf V'!K25","v":47163074.172042169}]
["Vote 4 - COMMUNITY SERVICES",null,815083,815083,1615083,1215083,815083,1215083,1815083,815083,1815083,815083,815083,-1333312.8518000003,{"$f":"'A3-FinPerf V'!I26","v":11232600.1482},{"$f":"'A3-FinPerf V'!J26","v":11503281.149682},{"$f":"'A3-FinPerf V'!K26","v":11786328.616178822}]
["Vote 5 - CORPORATE SERVICES",null,2138083,3138083,2138083,2138083,3138083,2138083,2138083,3138083,2138083,2138083,2138083,4589253.6963999979,{"$f":"'A3-FinPerf V'!I27","v":31108166.696399998},{"$f":"'A3-FinPerf V'!J27","v":32454293.363364},{"$f":"'A3-FinPerf V'!K27","v":33877019.041997641}]
["Vote 6 - FINANCIAL SERVICES",null,9902686.8670176677,7820251.8670176677,-741778.13298233226,-838739.13298233226,14917688.867017668,1160051.8670176677,653372.86701766774,-1976090.1329823323,26071134.907017663,-220746.13298233226,-7525.1329823322594,13736912.411305651,{"$f":"'A3-FinPerf V'!I28","v":70477220.988499999},{"$f":"'A3-FinPerf V'!J28","v":72022034.526384994},{"$f":"'A3-FinPerf V'!K28","v":73656876.818626851}]
["Vote 7 - INFRASTRUCTURE SERVICES",null,2485250,3000000,2485250,1985250,2985250,2485250,2485250,2485250,2485250,2485250,2485250,10105205.1241,{"$f":"'A3-FinPerf V'!I29","v":37957705.1241},{"$f":"'A3-FinPerf V'!J29","v":43022600.175751001},{"$f":"'A3-FinPerf V'!K29","v":49736477.745943524}]
["Vote 8 - SERVICE DELIVERY AND PUBLIC SAFETY",null,null,null,null,null,null,null,null,null,null,null,null,{"$f":"O30-SUM(C30:M30)","v":0},{"$f":"'A3-FinPerf V'!I30","v":0},{"$f":"'A3-FinPerf V'!J30","v":0},{"$f":"'A3-FinPerf V'!K30","v":0}]
["Vote 9 - [NAME OF VOTE 9]",null,null,null,null,null,null,null,null,null,null,null,null,{"$f":"O31-SUM(C31:M31)","v":0},{"$f":"'A3-FinPerf V'!I31","v":0},{"$f":"'A3-FinPerf V'!J31","v":0},{"$f":"'A3-FinPerf V'!K31","v":0}]
[{"$f":"A14","v":"Vote 10 - [NAME OF VOTE 10]"},null,null,null,null,null,null,null,null,null,null,null,null,{"$f":"O32-SUM(C32:M32)","v":0},{"$f":"'A3-FinPerf V'!I32","v":0},{"$f":"'A3-FinPerf V'!J32","v":0},{"$f":"'A3-FinPerf V'!K32","v":0}]
["Vote 11 - [NAME OF VOTE 11]",null,null,null,null,null,null,null,null,null,null,null,null,0,{"$f":"'A3-FinPerf V'!I33","v":0},{"$f":"'A3-FinPerf V'!J33","v":0},{"$f":"'A3-FinPerf V'!K33","v":0}]
["Vote 12 - [NAME OF VOTE 12]",null,null,null,null,null,null,null,null,null,null,null,null,0,{"$f":"'A3-FinPerf V'!I34","v":0},{"$f":"'A3-FinPerf V'!J34","v":0},{"$f":"'A3-FinPerf V'!K34","v":0}]
["Vote 13 - [NAME OF VOTE 13]",null,null,null,null,null,null,null,null,null,null,null,null,0,{"$f":"'A3-FinPerf V'!I35","v":0},{"$f":"'A3-FinPerf V'!J35","v":0},{"$f":"'A3-FinPerf V'!K35","v":0}]
["Vote 14 - [NAME OF VOTE 14]",null,null,null,null,null,null,null,null,null,null,null,null,0,{"$f":"'A3-FinPerf V'!I36","v":0},{"$f":"'A3-FinPerf V'!J36","v":0},{"$f":"'A3-FinPerf V'!K36","v":0}]
["Vote 15 - [NAME OF VOTE 15]",null,null,null,null,null,null,null,null,null,null,null,null,0,{"$f":"'A3-FinPerf V'!I37","v":0},{"$f":"'A3-FinPerf V'!J37","v":0},{"$f":"'A3-FinPerf V'!K37","v":0}]
[{"$f":"'A3-FinPerf V'!A38","v":"Total Expenditure by Vote"},null,{"$f":"SUM(C23:C37)","v":19501345.867017668},{"$f":"SUM(D23:D37)","v":20005386.867017668},10651849.867017668,9672051.8670176677,26014337.867017668,12247820.867017668,12250021.867017668,9622558.8670176677,36659893.907017663,10368012.867017668,10390223.867017668,36147504.341417648,{"$f":"SUM(O23:O37)","v":213531008.918612},{"$f":"SUM(P23:P37)","v":223130853.33620811},{"$f":"SUM(Q23:Q37)","v":234407925.84998319}]
[]
[{"$f":"'A4-FinPerf RE'!A38&\" before assoc.\"","v":"Surplus/(Deficit) before assoc."},null,{"$f":"C20-C38","v":20465674.132982332},-41074.867017667741,-1855150.8670176677,-3856274.8670176677,13569197.132982332,-5658163.8670176677,-5998686.8670176677,-3631034.8670176677,-1837861.9070176631,-3398237.8670176677,-4545820.8670176677,18465731.566875361,21678295.989681005,25067859.293209881,32645959.598852813]
[]
[{"$f":"'SA25'!A43","v":"Taxation"},null,null,null,null,null,null,null,null,null,null,null,null,{"$f":"O42-SUM(C42:M42)","v":0},{"$f":"'SA25'!O43","v":0},{"$f":"'SA25'!P43","v":0},{"$f":"'SA25'!Q43","v":0}]
[{"$f":"'SA25'!A44","v":"Attributable to minorities"},null,null,null,null,null,null,null,null,null,null,null,null,{"$f":"O43-SUM(C43:M43)","v":0},{"$f":"'SA25'!O44","v":0},{"$f":"'SA25'!P44","v":0},{"$f":"'SA25'!Q44","v":0}]
[{"$f":"'A4-FinPerf RE'!A47","v":"Share of surplus/ (deficit) of associate"},null,null,null,null,null,null,null,null,null,null,null,null,{"$f":"O44-SUM(C44:M44)","v":0},{"$f":"'A4-FinPerf RE'!J47","v":0},{"$f":"'A4-FinPerf RE'!K47","v":0},{"$f":"'A4-FinPerf RE'!L47","v":0}]
[{"$f":"'A4-FinPerf RE'!A38","v":"Surplus/(Deficit)"},1,{"$f":"C40+C44","v":20465674.132982332},{"$f":"D40+D44","v":-41074.867017667741},-1855150.8670176677,-3856274.8670176677,13569197.132982332,-5658163.8670176677,-5998686.8670176677,-3631034.8670176677,-1837861.9070176631,-3398237.8670176677,-4545820.8670176677,18465731.566875361,21678295.989681005,25067859.293209881,32645959.598852813]
[{"$f":"head27a","v":"References"}]
["1. Surplus (Deficit) must reconcile with Budgeted Financial Performance"]
["check",null,null,null,null,null,null,null,null,null,null,null,null,null,{"$f":"O45-'A4-FinPerf RE'!J48","v":2.0861625671386719E-7},{"$f":"P45-'A4-FinPerf RE'!K48","v":-5.3644180297851563E-7},{"$f":"Q45-'A4-FinPerf RE'!L48","v":1.1920928955078125E-7}]

{"sheet":"SA27","index":47,"n_rows":56,"n_cols":17,"rows_kept":56,"cut":false,"hidden":false,"merged":[[1,2,1,13],[1,14,1,16]]}
[{"$f":"muni&\" - \"&TableA27","v":"FS205 Mafube - Supporting Table SA27 Budgeted monthly revenue and expenditure (standard classification)"}]
[{"$f":"desc","v":"Description"},{"$f":"head27","v":"Ref"},{"$f":"Head9","v":"Budget Year 2017/18"},null,null,null,null,null,null,null,null,null,null,null,"Medium Term Revenue and Expenditure Framework"]
["R thousand",null,"July","August","Sept.","October","November","December","January","February","March","April","May","June",{"$f":"Head9","v":"Budget Year 2017/18"},{"$f":"Head10","v":"Budget Year +1 2018/19"},{"$f":"Head11","v":"Budget Year +2 2019/20"}]
[{"$f":"'A2-FinPerf SC'!A4","v":"Revenue - Standard"}]
[{"$f":"'A2-FinPerf SC'!A5","v":"Governance and administration"},null,{"$f":"SUM(C6:C8)","v":38207253},{"$f":"SUM(D6:D8)","v":6290147},{"$f":"SUM(E6:E8)","v":7020683},4024278,28136345,4853804,4395421,4067209,26621593,5027603,4128810,{"$f":"O5-SUM(C5:M5)","v":13293732.280000001},{"$f":"'A2-FinPerf SC'!I5","v":146066878.28},{"$f":"'A2-FinPerf SC'!J5","v":156781478},{"$f":"'A2-FinPerf SC'!K5","v":165780513}]
[{"$f":"'A2-FinPerf SC'!A6","v":"Executive and council"},null,null,null,null,null,null,null,null,null,null,null,null,0,{"$f":"'A2-FinPerf SC'!I6","v":0},{"$f":"'A2-FinPerf SC'!J6","v":0},{"$f":"'A2-FinPerf SC'!K6","v":0}]
[{"$f":"'A2-FinPerf SC'!A7","v":"Budget and treasury office"},null,38207253,6290147,7020683,4024278,28136345,4853804,4395421,4067209,26621593,5027603,4128810,13293732.280000001,{"$f":"'A2-FinPerf SC'!I7","v":146066878.28},{"$f":"'A2-FinPerf SC'!J7","v":156781478},{"$f":"'A2-FinPerf SC'!K7","v":165780513}]
[{"$f":"'A2-FinPerf SC'!A8","v":"Corporate services"},null,null,null,null,null,null,null,null,null,null,null,null,0,{"$f":"'A2-FinPerf SC'!I8","v":0},{"$f":"'A2-FinPerf SC'!J8","v":0},{"$f":"'A2-FinPerf SC'!K8","v":0}]
[{"$f":"'A2-FinPerf SC'!A9","v":"Community and public safety"},null,{"$f":"SUM(C10:C14)","v":0},{"$f":"SUM(D10:D14)","v":0},0,0,0,0,0,0,0,0,0,0,{"$f":"'A2-FinPerf SC'!I9","v":0},{"$f":"'A2-FinPerf SC'!J9","v":0},{"$f":"'A2-FinPerf SC'!K9","v":0}]
[{"$f":"'A2-FinPerf SC'!A10","v":"Community and social services"},null,null,null,null,null,null,null,null,null,null,null,null,0,{"$f":"'A2-FinPerf SC'!I10","v":0},{"$f":"'A2-FinPerf SC'!J10","v":0},{"$f":"'A2-FinPerf SC'!K10","v":0}]
[{"$f":"'A2-FinPerf SC'!A11","v":"Sport and recreation"},null,null,null,null,null,null,null,null,null,null,null,null,0,{"$f":"'A2-FinPerf SC'!I11","v":0},{"$f":"'A2-FinPerf SC'!J11","v":0},{"$f":"'A2-FinPerf SC'!K11","v":0}]
[{"$f":"'A2-FinPerf SC'!A12","v":"Public safety"},null,null,null,null,null,null,null,null,null,null,null,null,0,{"$f":"'A2-FinPerf SC'!I12","v":0},{"$f":"'A2-FinPerf SC'!J12","v":0},{"$f":"'A2-FinPerf SC'!K12","v":0}]
[{"$f":"'A2-FinPerf SC'!A13","v":"Housing"},null,null,null,null,null,null,null,null,null,null,null,null,0,{"$f":"'A2-FinPerf SC'!I13","v":0},{"$f":"'A2-FinPerf SC'!J13","v":0},{"$f":"'A2-FinPerf SC'!K13","v":0}]
[{"$f":"'A2-FinPerf SC'!A14","v":"Health"},null,null,null,null,null,null,null,null,null,null,null,null,0,{"$f":"'A2-FinPerf SC'!I14","v":0},{"$f":"'A2-FinPerf SC'!J14","v":0},{"$f":"'A2-FinPerf SC'!K14","v":0}]
[{"$f":"'A2-FinPerf SC'!A15","v":"Economic and environmental services"},null,{"$f":"SUM(C16:C18)","v":0},{"$f":"SUM(D16:D18)","v":0},0,0,0,0,0,0,0,0,0,0,{"$f":"'A2-FinPerf SC'!I15","v":0},{"$f":"'A2-FinPerf SC'!J15","v":0},{"$f":"'A2-FinPerf SC'!K15","v":0}]
[{"$f":"'A2-FinPerf SC'!A16","v":"Planning and development"},null,null,null,null,null,null,null,null,null,null,null,null,0,{"$f":"'A2-FinPerf SC'!I16","v":0},{"$f":"'A2-FinPerf SC'!J16","v":0},{"$f":"'A2-FinPerf SC'!K16","v":0}]
[{"$f":"'A2-FinPerf SC'!A17","v":"Road transport"},null,null,null,null,null,null,null,null,null,null,null,null,0,{"$f":"'A2-FinPerf SC'!I17","v":0},{"$f":"'A2-FinPerf SC'!J17","v":0},{"$f":"'A2-FinPerf SC'!K17","v":0}]
[{"$f":"'A2-FinPerf SC'!A18","v":"Environmental protection"},null,null,null,null,null,null,null,null,null,null,null,null,0,{"$f":"'A2-FinPerf SC'!I18","v":0},{"$f":"'A2-FinPerf SC'!J18","v":0},{"$f":"'A2-FinPerf SC'!K18","v":0}]
[{"$f":"'A2-FinPerf SC'!A19","v":"Trading services"},null,{"$f":"SUM(C20:C23)","v":1426434},{"$f":"SUM(D20:D23)","v":1442853},1442683,1458166,1245199,1402520,1522581,1590982,1489406,1608839,1382260,{"$f":"O19-SUM(C19:M19)","v":46050503.628059998},{"$f":"'A2-FinPerf SC'!I19","v":62062426.628059998},{"$f":"'A2-FinPerf SC'!J19","v":67543234.652371705},{"$f":"'A2-FinPerf SC'!K19","v":76236371.966166407}]
[{"$f":"'A2-FinPerf SC'!A20","v":"Electricity"},null,333333,333333,333333,333333,333333,333333,333333,333333,333333,333333,333333,1333337,{"$f":"'A2-FinPerf SC'!I20","v":5000000},{"$f":"'A2-FinPerf SC'!J20","v":7000000},{"$f":"'A2-FinPerf SC'!K20","v":12000000}]
[{"$f":"'A2-FinPerf SC'!A21","v":"Water"},null,589235,653212,585485,635214,458978,587548,542584,654565,545454,704510,523245,18027754.338780001,{"$f":"'A2-FinPerf SC'!I21","v":24507784.338780001},{"$f":"'A2-FinPerf SC'!J21","v":26002759.183445599},{"$f":"'A2-FinPerf SC'!K21","v":27588927.4936358}]
[{"$f":"'A2-FinPerf SC'!A22","v":"Waste water management"},null,298754,254854,301542,285478,245744,235895,321412,301542,325141,325252,289787,15675097.714960001,{"$f":"'A2-FinPerf SC'!I22","v":18860498.714960001},{"$f":"'A2-FinPerf SC'!J22","v":20010989.136572599},{"$f":"'A2-FinPerf SC'!K22","v":21231659.4739035}]
[{"$f":"'A2-FinPerf SC'!A23","v":"Waste management"},null,205112,201454,222323,204141,207144,245744,325252,301542,285478,245744,235895,11014314.57432,{"$f":"'A2-FinPerf SC'!I23","v":13694143.57432},{"$f":"'A2-FinPerf SC'!J23","v":14529486.332353501},{"$f":"'A2-FinPerf SC'!K23","v":15415784.9986271}]
[{"$f":"'A2-FinPerf SC'!A24","v":"Other"},null,333333,12231312,333333,333333,10201991,333333,333333,333333,6711033,333333,333333,-4731000,{"$f":"'A2-FinPerf SC'!I24","v":27080000},{"$f":"'A2-FinPerf SC'!J24","v":23874000},{"$f":"'A2-FinPerf SC'!K24","v":25037000}]
[{"$f":"'A2-FinPerf SC'!A25","v":"Total Revenue - Standard"},null,{"$f":"C5+C9+C15+C19+C24","v":39967020},19964312,8796699,5815777,39583535,6589657,6251335,5991524,34822032,6969775,5844403,54613235.908059999,235209304.90806001,248198712.6523717,267053884.96616641]
[null,null,null,{"$f":"D6+D10+D16+D20+D25","v":20297645},9130032,6149110,39916868,6922990,6584668,6324857,35155365,7303108,{"$f":"M6+M10+M16+M20+M25","v":6177736}]
[{"$f":"'A2-FinPerf SC'!A27","v":"Expenditure - Standard"}]
[{"$f":"'A2-FinPerf SC'!A28","v":"Governance and administration"},null,{"$f":"SUM(C29:C31)","v":7113409},{"$f":"SUM(D29:D31)","v":9185135},{"$f":"SUM(E29:E31)","v":8908378},8525541,8111399,8602519,9111399,9113399,8103509,8103509,7912499,{"$f":"O28-SUM(C28:M28)","v":71550007.646311998},{"$f":"'A2-FinPerf SC'!I28","v":164340703.646312},{"$f":"'A2-FinPerf SC'!J28","v":168604972.01077512},{"$f":"'A2-FinPerf SC'!K28","v":172885119.48786089}]
[{"$f":"'A2-FinPerf SC'!A29","v":"Executive and council"},null,4160243,5231969,5155212,5172375,4158233,5249353,5158233,5160233,4150343,5150343,4959333,9049445.9614119977,{"$f":"'A2-FinPerf SC'!I29","v":62755315.961411998},{"$f":"'A2-FinPerf SC'!J29","v":64128644.121026114},{"$f":"'A2-FinPerf SC'!K29","v":65351223.627236381}]
[{"$f":"'A2-FinPerf SC'!A30","v":"Budget and treasury office"},null,815083,815083,1615083,1215083,815083,1215083,1815083,815083,1815083,815083,815083,57911307.988499999,{"$f":"'A2-FinPerf SC'!I30","v":70477220.988499999},{"$f":"'A2-FinPerf SC'!J30","v":72022034.526384994},{"$f":"'A2-FinPerf SC'!K30","v":73656876.818626851}]
[{"$f":"'A2-FinPerf SC'!A31","v":"Corporate services"},null,2138083,3138083,2138083,2138083,3138083,2138083,2138083,3138083,2138083,2138083,2138083,4589253.6963999979,{"$f":"'A2-FinPerf SC'!I31","v":31108166.696399998},{"$f":"'A2-FinPerf SC'!J31","v":32454293.363364},{"$f":"'A2-FinPerf SC'!K31","v":33877019.041997641}]
[{"$f":"'A2-FinPerf SC'!A32","v":"Community and public safety"},null,{"$f":"SUM(C33:C37)","v":815083},{"$f":"SUM(D33:D37)","v":815083},1615083,1215083,815083,1215083,1815083,815083,1815083,815083,815083,-1333312.8518000003,{"$f":"'A2-FinPerf SC'!I32","v":11232600.1482},{"$f":"'A2-FinPerf SC'!J32","v":11503281.149682},{"$f":"'A2-FinPerf SC'!K32","v":11786328.61617882}]
[{"$f":"'A2-FinPerf SC'!A33","v":"Community and social services"},null,815083,815083,1615083,1215083,815083,1215083,1815083,815083,1815083,815083,815083,-1333312.8518000003,{"$f":"'A2-FinPerf SC'!I33","v":11232600.1482},{"$f":"'A2-FinPerf SC'!J33","v":11503281.149682},{"$f":"'A2-FinPerf SC'!K33","v":11786328.61617882}]
[{"$f":"'A2-FinPerf SC'!A34","v":"Sport and recreation"},null,null,null,null,null,null,null,null,null,null,null,null,0,{"$f":"'A2-FinPerf SC'!I34","v":0},{"$f":"'A2-FinPerf SC'!J34","v":0},{"$f":"'A2-FinPerf SC'!K34","v":0}]
[{"$f":"'A2-FinPerf SC'!A35","v":"Public safety"},null,null,null,null,null,null,null,null,null,null,null,null,0,{"$f":"'A2-FinPerf SC'!I35","v":0},{"$f":"'A2-FinPerf SC'!J35","v":0},{"$f":"'A2-FinPerf SC'!K35","v":0}]
[{"$f":"'A2-FinPerf SC'!A36","v":"Housing"},null,null,null,null,null,null,null,null,null,null,null,null,0,{"$f":"'A2-FinPerf SC'!I36","v":0},{"$f":"'A2-FinPerf SC'!J36","v":0},{"$f":"'A2-FinPerf SC'!K36","v":0}]
[{"$f":"'A2-FinPerf SC'!A37","v":"Health"},null,null,null,null,null,null,null,null,null,null,null,null,0,{"$f":"'A2-FinPerf SC'!I37","v":0},{"$f":"'A2-FinPerf SC'!J37","v":0},{"$f":"'A2-FinPerf SC'!K37","v":0}]
[{"$f":"'A2-FinPerf SC'!A38","v":"Economic and environmental services"},null,{"$f":"SUM(C39:C41)","v":400583},{"$f":"SUM(D39:D41)","v":400583},300583,100583,400583,400583,400583,400583,400583,400583,400583,{"$f":"O38-SUM(C38:M38)","v":905575.82010000013},{"$f":"'A2-FinPerf SC'!I38","v":4911988.8201000001},{"$f":"'A2-FinPerf SC'!J38","v":6671108.7083010003},{"$f":"'A2-FinPerf SC'!K38","v":8984366.4653840102}]
[{"$f":"'A2-FinPerf SC'!A39","v":"Planning and development"},null,null,null,null,null,null,null,null,null,null,null,null,0,{"$f":"'A2-FinPerf SC'!I39","v":0},{"$f":"'A2-FinPerf SC'!J39","v":0},{"$f":"'A2-FinPerf SC'!K39","v":0}]
[{"$f":"'A2-FinPerf SC'!A40","v":"Road transport"},null,400583,400583,300583,100583,400583,400583,400583,400583,400583,400583,400583,905575.82010000013,{"$f":"'A2-FinPerf SC'!I40","v":4911988.8201000001},{"$f":"'A2-FinPerf SC'!J40","v":6671108.7083010003},{"$f":"'A2-FinPerf SC'!K40","v":8984366.4653840102}]
[{"$f":"'A2-FinPerf SC'!A41","v":"Environmental protection"},null,null,null,null,null,null,null,null,null,null,null,null,0,{"$f":"'A2-FinPerf SC'!I41","v":0},{"$f":"'A2-FinPerf SC'!J41","v":0},{"$f":"'A2-FinPerf SC'!K41","v":0}]
[{"$f":"'A2-FinPerf SC'!A42","v":"Trading services"},null,{"$f":"SUM(C43:C46)","v":2584667},{"$f":"SUM(D43:D46)","v":2599417},2684667,1884667,2584667,3584667,2584667,2584667,2584667,2584667,2584667,{"$f":"O42-SUM(C42:M42)","v":2961542.0615999997},{"$f":"'A2-FinPerf SC'!I42","v":31807629.0616},{"$f":"'A2-FinPerf SC'!J42","v":35101483.352625996},{"$f":"'A2-FinPerf SC'!K42","v":39474688.644587271}]
[{"$f":"'A2-FinPerf SC'!A43","v":"Electricity"},null,639667,639667,639667,339667,639667,639667,639667,639667,639667,639667,639667,949004.08050000016,{"$f":"'A2-FinPerf SC'!I43","v":7685341.0805000002},{"$f":"'A2-FinPerf SC'!J43","v":9885494.4913050011},{"$f":"'A2-FinPerf SC'!K43","v":11937082.73621805}]
[{"$f":"'A2-FinPerf SC'!A44","v":"Water"},null,1945000,1959750,2045000,1545000,1945000,2945000,1945000,1945000,1945000,1945000,1945000,2012537.9811000004,{"$f":"'A2-FinPerf SC'!I44","v":24122287.9811},{"$f":"'A2-FinPerf SC'!J44","v":25215988.861320999},{"$f":"'A2-FinPerf SC'!K44","v":27537605.908369221}]
[{"$f":"'A2-FinPerf SC'!A45","v":"Waste water management"},null,null,null,null,null,null,null,null,null,null,null,null,0,{"$f":"'A2-FinPerf SC'!I45","v":0},{"$f":"'A2-FinPerf SC'!J45","v":0},{"$f":"'A2-FinPerf SC'!K45","v":0}]
[{"$f":"'A2-FinPerf SC'!A46","v":"Waste management"},null,null,null,null,null,null,null,null,null,null,null,null,0,{"$f":"'A2-FinPerf SC'!I46","v":0},{"$f":"'A2-FinPerf SC'!J46","v":0},{"$f":"'A2-FinPerf SC'!K46","v":0}]
[{"$f":"'A2-FinPerf SC'!A47","v":"Other"},null,81667,81667,81667,81667,81667,81667,81667,81667,81667,81667,81667,339750.24239999987,{"$f":"'A2-FinPerf SC'!I47","v":1238087.2423999999},{"$f":"'A2-FinPerf SC'!J47","v":1250008.114824},{"$f":"'A2-FinPerf SC'!K47","v":1277422.63597224}]
[{"$f":"'A2-FinPerf SC'!A48","v":"Total Expenditure - Standard"},null,{"$f":"C28+C32+C38+C42+C47","v":10995409},{"$f":"D28+D32+D38+D42+D47","v":13081885},13590378,11807541,11993399,13884519,13993399,12995399,12985509,11985509,11794499,74423562.918612003,213531008.918612,223130853.33620813,{"$f":"Q28+Q32+Q38+Q42+Q47","v":234407925.84998322}]
[]
[{"$f":"'A4-FinPerf RE'!A38&\" before assoc.\"","v":"Surplus/(Deficit) before assoc."},null,{"$f":"C25-C48","v":28971611},6882427,-4793679,-5991764,27590136,-7294862,-7742064,-7003875,21836523,-5015734,-5950096,-19810327.010552004,21678295.989448011,25067859.31616357,32645959.116183192]
[]
[{"$f":"'A4-FinPerf RE'!A47","v":"Share of surplus/ (deficit) of associate"},null,null,null,null,null,null,null,null,null,null,null,null,{"$f":"O52-SUM(C52:M52)","v":0},{"$f":"'A4-FinPerf RE'!J47","v":0},{"$f":"'A4-FinPerf RE'!K47","v":0},{"$f":"'A4-FinPerf RE'!L47","v":0}]
[{"$f":"'A4-FinPerf RE'!A38","v":"Surplus/(Deficit)"},1,{"$f":"C50+C52","v":28971611},{"$f":"D50+D52","v":6882427},-4793679,-5991764,27590136,-7294862,-7742064,-7003875,21836523,-5015734,-5950096,-19810327.010552004,21678295.989448011,25067859.31616357,32645959.116183192]
[{"$f":"head27a","v":"References"}]
["1. Surplus (Deficit) must reconcile with Budeted Financial Performance"]
["check",null,null,null,null,null,null,null,null,null,null,null,null,null,{"$f":"O53-'A4-FinPerf RE'!J48","v":-2.3278594017028809E-4},{"$f":"P53-'A4-FinPerf RE'!K48","v":2.2953152656555176E-2},{"$f":"Q53-'A4-FinPerf RE'!L48","v":-0.48266950249671936}]

{"sheet":"SA28","index":48,"n_rows":47,"n_cols":17,"rows_kept":47,"cut":false,"hidden":false,"merged":[[1,2,1,13],[1,14,1,16]]}
[{"$f":"muni&\" - \"& TableA28","v":"FS205 Mafube - Supporting Table SA28 Budgeted monthly capital expenditure (municipal vote)"}]
[{"$f":"desc","v":"Description"},{"$f":"head27","v":"Ref"},{"$f":"Head9","v":"Budget Year 2017/18"},null,null,null,null,null,null,null,null,null,null,null,"Medium Term Revenue and Expenditure Framework"]
["R thousand",null,"July","August","Sept.","October","Nov.","Dec.","January","Feb.","March","April","May","June",{"$f":"Head9","v":"Budget Year 2017/18"},{"$f":"Head10","v":"Budget Year +1 2018/19"},{"$f":"Head11","v":"Budget Year +2 2019/20"}]
["Multi-year expenditure to be appropriated",1]
[{"$f":"'A5-Capex'!A6","v":"Vote 1 - OFFICE OF THE MAYOR"},null,null,null,null,null,null,null,null,null,null,null,null,{"$f":"O5-SUM(C5:M5)","v":0},{"$f":"'A5-Capex'!J6","v":0},{"$f":"'A5-Capex'!K6","v":0},{"$f":"'A5-Capex'!L6","v":0}]
[{"$f":"'A5-Capex'!A7","v":"Vote 2 - OFFICE OF THE SPEAKER"},null,null,null,null,null,null,null,null,null,null,null,null,{"$f":"O6-SUM(C6:M6)","v":0},{"$f":"'A5-Capex'!J7","v":0},{"$f":"'A5-Capex'!K7","v":0},{"$f":"'A5-Capex'!L7","v":0}]
[{"$f":"'A5-Capex'!A8","v":"Vote 3 - OFFICE OF THE MUNICIPAL MANAGER"},null,null,null,null,null,null,null,null,null,null,null,null,0,{"$f":"'A5-Capex'!J8","v":0},{"$f":"'A5-Capex'!K8","v":0},{"$f":"'A5-Capex'!L8","v":0}]
[{"$f":"'A5-Capex'!A9","v":"Vote 4 - COMMUNITY SERVICES"},null,null,null,null,null,null,null,null,null,null,null,null,0,{"$f":"'A5-Capex'!J9","v":0},{"$f":"'A5-Capex'!K9","v":0},{"$f":"'A5-Capex'!L9","v":0}]
[{"$f":"'A5-Capex'!A10","v":"Vote 5 - CORPORATE SERVICES"},null,null,null,null,null,null,null,null,null,null,null,null,0,{"$f":"'A5-Capex'!J10","v":0},{"$f":"'A5-Capex'!K10","v":0},{"$f":"'A5-Capex'!L10","v":0}]
[{"$f":"'A5-Capex'!A11","v":"Vote 6 - FINANCIAL SERVICES"},null,null,null,null,null,null,null,null,null,null,null,null,0,{"$f":"'A5-Capex'!J11","v":0},{"$f":"'A5-Capex'!K11","v":0},{"$f":"'A5-Capex'!L11","v":0}]
[{"$f":"'A5-Capex'!A12","v":"Vote 7 - INFRASTRUCTURE SERVICES"},null,null,null,null,null,null,null,null,null,null,null,null,0,{"$f":"'A5-Capex'!J12","v":0},{"$f":"'A5-Capex'!K12","v":0},{"$f":"'A5-Capex'!L12","v":0}]
[{"$f":"'A5-Capex'!A13","v":"Vote 8 - SERVICE DELIVERY AND PUBLIC SAFETY"},null,null,null,null,null,null,null,null,null,null,null,null,{"$f":"O12-SUM(C12:M12)","v":0},{"$f":"'A5-Capex'!J13","v":0},{"$f":"'A5-Capex'!K13","v":0},{"$f":"'A5-Capex'!L13","v":0}]
[{"$f":"'A5-Capex'!A14","v":"Vote 9 - [NAME OF VOTE 9]"},null,null,null,null,null,null,null,null,null,null,null,null,{"$f":"O13-SUM(C13:M13)","v":0},{"$f":"'A5-Capex'!J14","v":0},{"$f":"'A5-Capex'!K14","v":0},{"$f":"'A5-Capex'!L14","v":0}]
[{"$f":"'A5-Capex'!A15","v":"Vote 10 - [NAME OF VOTE 10]"},null,null,null,null,null,null,null,null,null,null,null,null,{"$f":"O14-SUM(C14:M14)","v":0},{"$f":"'A5-Capex'!J15","v":0},{"$f":"'A5-Capex'!K15","v":0},{"$f":"'A5-Capex'!L15","v":0}]
[{"$f":"'A5-Capex'!A16","v":"Vote 11 - [NAME OF VOTE 11]"},null,null,null,null,null,null,null,null,null,null,null,null,0,{"$f":"'A5-Capex'!J16","v":0},{"$f":"'A5-Capex'!K16","v":0},{"$f":"'A5-Capex'!L16","v":0}]
[{"$f":"'A5-Capex'!A17","v":"Vote 12 - [NAME OF VOTE 12]"},null,null,null,null,null,null,null,null,null,null,null,null,0,{"$f":"'A5-Capex'!J17","v":0},{"$f":"'A5-Capex'!K17","v":0},{"$f":"'A5-Capex'!L17","v":0}]
[{"$f":"'A5-Capex'!A18","v":"Vote 13 - [NAME OF VOTE 13]"},null,null,null,null,null,null,null,null,null,null,null,null,0,{"$f":"'A5-Capex'!J18","v":0},{"$f":"'A5-Capex'!K18","v":0},{"$f":"'A5-Capex'!L18","v":0}]
[{"$f":"'A5-Capex'!A19","v":"Vote 14 - [NAME OF VOTE 14]"},null,null,null,null,null,null,null,null,null,null,null,null,0,{"$f":"'A5-Capex'!J19","v":0},{"$f":"'A5-Capex'!K19","v":0},{"$f":"'A5-Capex'!L19","v":0}]
[{"$f":"'A5-Capex'!A20","v":"Vote 15 - [NAME OF VOTE 15]"},null,null,null,null,null,null,null,null,null,null,null,null,0,{"$f":"'A5-Capex'!J20","v":0},{"$f":"'A5-Capex'!K20","v":0},{"$f":"'A5-Capex'!L20","v":0}]
["Capital multi-year expenditure sub-total",2,{"$f":"SUM(C5:C19)","v":0},{"$f":"SUM(D5:D19)","v":0},0,0,0,0,0,0,0,0,{"$f":"SUM(M5:M19)","v":0},0,0,0,0]
[]
["Single-year expenditure to be appropriated"]
[{"$f":"'A5-Capex'!A24","v":"Vote 1 - OFFICE OF THE MAYOR"},null,null,null,null,null,null,null,null,null,null,null,null,{"$f":"O23-SUM(C23:M23)","v":0},{"$f":"'A5-Capex'!J24","v":0},{"$f":"'A5-Capex'!K24","v":0},{"$f":"'A5-Capex'!L24","v":0}]
[{"$f":"'A5-Capex'!A25","v":"Vote 2 - OFFICE OF THE SPEAKER"},null,null,null,null,null,null,null,null,null,null,null,null,{"$f":"O24-SUM(C24:M24)","v":0},{"$f":"'A5-Capex'!J25","v":0},{"$f":"'A5-Capex'!K25","v":0},{"$f":"'A5-Capex'!L25","v":0}]
[{"$f":"'A5-Capex'!A26","v":"Vote 3 - OFFICE OF THE MUNICIPAL MANAGER"},null,1500000,null,null,null,547500,null,null,null,352500,null,null,-400000,{"$f":"'A5-Capex'!J26","v":2000000},{"$f":"'A5-Capex'!K26","v":2122000},{"$f":"'A5-Capex'!L26","v":2251442}]
[{"$f":"'A5-Capex'!A27","v":"Vote 4 - COMMUNITY SERVICES"},null,3536508.92,null,null,null,1440000,null,null,null,1050400,null,null,1197161.7999999998,{"$f":"'A5-Capex'!J27","v":7224070.7199999997},{"$f":"'A5-Capex'!K27","v":1074330},{"$f":"'A5-Capex'!L27","v":1126665}]
[{"$f":"'A5-Capex'!A28","v":"Vote 5 - CORPORATE SERVICES"},null,2000000,null,null,null,600000,null,null,null,2140000,null,null,-4740000,{"$f":"'A5-Capex'!J28","v":0},{"$f":"'A5-Capex'!K28","v":0},{"$f":"'A5-Capex'!L28","v":0}]
[{"$f":"'A5-Capex'!A29","v":"Vote 6 - FINANCIAL SERVICES"},null,null,null,null,null,279163,null,null,null,30749,null,null,-309912,{"$f":"'A5-Capex'!J29","v":0},{"$f":"'A5-Capex'!K29","v":0},{"$f":"'A5-Capex'!L29","v":0}]
[{"$f":"'A5-Capex'!A30","v":"Vote 7 - INFRASTRUCTURE SERVICES"},null,2584571,2833333,333333,333333,4666670,333333,333333,333333,3704622.1199999992,333333,333333,7745314.9176000003,{"$f":"'A5-Capex'!J30","v":23867842.037599999},{"$f":"'A5-Capex'!K30","v":28799661.885175999},{"$f":"'A5-Capex'!L30","v":34898162.364027761}]
[{"$f":"'A5-Capex'!A31","v":"Vote 8 - SERVICE DELIVERY AND PUBLIC SAFETY"},null,null,null,null,null,null,null,null,null,null,null,null,{"$f":"O30-SUM(C30:M30)","v":0},{"$f":"'A5-Capex'!J31","v":0},{"$f":"'A5-Capex'!K31","v":0},{"$f":"'A5-Capex'!L31","v":0}]
[{"$f":"'A5-Capex'!A32","v":"Vote 9 - [NAME OF VOTE 9]"},null,null,null,null,null,null,null,null,null,null,null,null,{"$f":"O31-SUM(C31:M31)","v":0},{"$f":"'A5-Capex'!J32","v":0},{"$f":"'A5-Capex'!K32","v":0},{"$f":"'A5-Capex'!L32","v":0}]
[{"$f":"'A5-Capex'!A33","v":"Vote 10 - [NAME OF VOTE 10]"},null,null,null,null,null,null,null,null,null,null,null,null,{"$f":"O32-SUM(C32:M32)","v":0},{"$f":"'A5-Capex'!J33","v":0},{"$f":"'A5-Capex'!K33","v":0},{"$f":"'A5-Capex'!L33","v":0}]
[{"$f":"'A5-Capex'!A34","v":"Vote 11 - [NAME OF VOTE 11]"},null,null,null,null,null,null,null,null,null,null,null,null,0,{"$f":"'A5-Capex'!J34","v":0},{"$f":"'A5-Capex'!K34","v":0},{"$f":"'A5-Capex'!L34","v":0}]
[{"$f":"'A5-Capex'!A35","v":"Vote 12 - [NAME OF VOTE 12]"},null,null,null,null,null,null,null,null,null,null,null,null,0,{"$f":"'A5-Capex'!J35","v":0},{"$f":"'A5-Capex'!K35","v":0},{"$f":"'A5-Capex'!L35","v":0}]
[{"$f":"'A5-Capex'!A36","v":"Vote 13 - [NAME OF VOTE 13]"},null,null,null,null,null,null,null,null,null,null,null,null,0,{"$f":"'A5-Capex'!J36","v":0},{"$f":"'A5-Capex'!K36","v":0},{"$f":"'A5-Capex'!L36","v":0}]
[{"$f":"'A5-Capex'!A37","v":"Vote 14 - [NAME OF VOTE 14]"},null,null,null,null,null,null,null,null,null,null,null,null,0,{"$f":"'A5-Capex'!J37","v":0},{"$f":"'A5-Capex'!K37","v":0},{"$f":"'A5-Capex'!L37","v":0}]
[{"$f":"'A5-Capex'!A38","v":"Vote 15 - [NAME OF VOTE 15]"},null,null,null,null,null,null,null,null,null,null,null,null,0,{"$f":"'A5-Capex'!J38","v":0},{"$f":"'A5-Capex'!K38","v":0},{"$f":"'A5-Capex'!L38","v":0}]
["Capital single-year expenditure sub-total",2,{"$f":"SUM(C23:C37)","v":9621079.9199999999},2833333,333333,333333,7533333,333333,333333,333333,7278271.1199999992,333333,333333,3492564.7176000001,33091912.757599998,31995991.885175999,38276269.364027761]
["Total Capital Expenditure",2,{"$f":"C20+C38","v":9621079.9199999999},{"$f":"D20+D38","v":2833333},333333,333333,7533333,333333,333333,333333,7278271.1199999992,333333,333333,3492564.7176000001,{"$f":"O20+O38","v":33091912.757599998},{"$f":"P20+P38","v":31995991.885175999},{"$f":"Q20+Q38","v":38276269.364027761}]
[]
[]
[{"$f":"head27a","v":"References"}]
["1. Table should be completed as either Multi-Year expenditure appropriation or Budget Year and Forward Year estimates"]
["2. Total Capital Expenditure must reconcile to Budgeted Capital Expenditure"]
["check",null,null,null,null,null,null,null,null,null,null,null,null,null,{"$f":"O20-'A5-Capex'!J21","v":0},{"$f":"P20-'A5-Capex'!K21","v":0},{"$f":"Q20-'A5-Capex'!L21","v":0}]
[]
[null,null,null,null,"Add single year stuff"]

{"sheet":"SA29","index":49,"n_rows":40,"n_cols":17,"rows_kept":40,"cut":false,"hidden":false,"merged":[[1,2,1,13],[1,14,1,16]]}
[{"$f":"muni&\" - \"& TableA29","v":"FS205 Mafube - Supporting Table SA29 Budgeted monthly capital expenditure (standard classification)"}]
[{"$f":"desc","v":"Description"},{"$f":"head27","v":"Ref"},{"$f":"Head9","v":"Budget Year 2017/18"},null,null,null,null,null,null,null,null,null,null,null,"Medium Term Revenue and Expenditure Framework"]
["R thousand",null,"July","August","Sept.","October","Nov.","Dec.","January","Feb.","March","April","May","June",{"$f":"Head9","v":"Budget Year 2017/18"},{"$f":"Head10","v":"Budget Year +1 2018/19"},{"$f":"Head11","v":"Budget Year +2 2019/20"}]
[{"$f":"'A5-Capex'!A42","v":"Capital Expenditure - Standard"},1]
[{"$f":"'A5-Capex'!A43","v":"Governance and administration"},null,{"$f":"SUM(C6:C8)","v":3500000},{"$f":"SUM(D6:D8)","v":0},{"$f":"SUM(E6:E8)","v":0},0,1426663,0,0,0,2523249,0,0,{"$f":"O5-SUM(C5:M5)","v":-5449912},{"$f":"'A5-Capex'!J43","v":2000000},{"$f":"'A5-Capex'!K43","v":2122000},{"$f":"'A5-Capex'!L43","v":2251442}]
[{"$f":"'A5-Capex'!A44","v":"Executive and council"},null,1500000,0,0,0,547500,0,0,0,352500,0,0,{"$f":"O6-SUM(C6:M6)","v":-400000},{"$f":"'A5-Capex'!J44","v":2000000},{"$f":"'A5-Capex'!K44","v":2122000},{"$f":"'A5-Capex'!L44","v":2251442}]
[{"$f":"'A5-Capex'!A45","v":"Budget and treasury office"},null,null,null,null,null,279163,null,null,null,30749,null,null,-309912,{"$f":"'A5-Capex'!J45","v":0},{"$f":"'A5-Capex'!K45","v":0},{"$f":"'A5-Capex'!L45","v":0}]
[{"$f":"'A5-Capex'!A46","v":"Corporate services"},null,2000000,null,null,null,600000,null,null,null,2140000,null,null,-4740000,{"$f":"'A5-Capex'!J46","v":0},{"$f":"'A5-Capex'!K46","v":0},{"$f":"'A5-Capex'!L46","v":0}]
[{"$f":"'A5-Capex'!A47","v":"Community and public safety"},null,{"$f":"SUM(C10:C14)","v":3536508.92},{"$f":"SUM(D10:D14)","v":0},0,0,1440000,0,0,0,1050400,0,0,1197161.7999999998,{"$f":"'A5-Capex'!J47","v":7224070.7199999997},{"$f":"'A5-Capex'!K47","v":1074330},{"$f":"'A5-Capex'!L47","v":1126665}]
[{"$f":"'A5-Capex'!A48","v":"Community and social services"},null,2260000,null,null,null,1440000,null,null,null,null,null,null,-3700000,{"$f":"'A5-Capex'!J48","v":0},{"$f":"'A5-Capex'!K48","v":0},{"$f":"'A5-Capex'!L48","v":0}]
[{"$f":"'A5-Capex'!A49","v":"Sport and recreation"},null,1276508.92,null,null,null,null,null,null,null,1050400,null,null,4897161.8,{"$f":"'A5-Capex'!J49","v":7224070.7199999997},{"$f":"'A5-Capex'!K49","v":1074330},{"$f":"'A5-Capex'!L49","v":1126665}]
[{"$f":"'A5-Capex'!A50","v":"Public safety"},null,null,null,null,null,null,null,null,null,null,null,null,0,{"$f":"'A5-Capex'!J50","v":0},{"$f":"'A5-Capex'!K50","v":0},{"$f":"'A5-Capex'!L50","v":0}]
[{"$f":"'A5-Capex'!A51","v":"Housing"},null,null,null,null,null,null,null,null,null,null,null,null,0,{"$f":"'A5-Capex'!J51","v":0},{"$f":"'A5-Capex'!K51","v":0},{"$f":"'A5-Capex'!L51","v":0}]
[{"$f":"'A5-Capex'!A52","v":"Health"},null,null,null,null,null,null,null,null,null,null,null,null,0,{"$f":"'A5-Capex'!J52","v":0},{"$f":"'A5-Capex'!K52","v":0},{"$f":"'A5-Capex'!L52","v":0}]
[{"$f":"'A5-Capex'!A53","v":"Economic and environmental services"},null,{"$f":"SUM(C16:C18)","v":0},{"$f":"SUM(D16:D18)","v":0},0,0,0,0,0,0,0,0,0,0,{"$f":"'A5-Capex'!J53","v":0},{"$f":"'A5-Capex'!K53","v":2958082.85},{"$f":"'A5-Capex'!L53","v":1456380}]
[{"$f":"'A5-Capex'!A54","v":"Planning and development"},null,null,null,null,null,null,null,null,null,null,null,null,0,{"$f":"'A5-Capex'!J54","v":0},{"$f":"'A5-Capex'!K54","v":0},{"$f":"'A5-Capex'!L54","v":0}]
[{"$f":"'A5-Capex'!A55","v":"Road transport"},null,null,null,null,null,null,null,null,null,null,null,null,0,{"$f":"'A5-Capex'!J55","v":0},{"$f":"'A5-Capex'!K55","v":2958082.85},{"$f":"'A5-Capex'!L55","v":1456380}]
[{"$f":"'A5-Capex'!A56","v":"Environmental protection"},null,null,null,null,null,null,null,null,null,null,null,null,0,{"$f":"'A5-Capex'!J56","v":0},{"$f":"'A5-Capex'!K56","v":0},{"$f":"'A5-Capex'!L56","v":0}]
[{"$f":"'A5-Capex'!A57","v":"Trading services"},null,{"$f":"SUM(C20:C23)","v":2584571},{"$f":"SUM(D20:D23)","v":2833333},333333,333333,4666670,333333,333333,333333,3704622.1199999992,333333,333333,{"$f":"O19-SUM(C19:M19)","v":7379402.160000002},{"$f":"'A5-Capex'!J57","v":23501929.280000001},{"$f":"'A5-Capex'!K57","v":25647887.149999999},{"$f":"'A5-Capex'!L57","v":33202105}]
[{"$f":"'A5-Capex'!A58","v":"Electricity"},null,333333,333333,333333,333333,666670,333333,333333,333333,333333,333333,333333,1000000,{"$f":"'A5-Capex'!J58","v":5000000},{"$f":"'A5-Capex'!K58","v":7000000},{"$f":"'A5-Capex'!L58","v":12000000}]
[{"$f":"'A5-Capex'!A59","v":"Water"},null,2251238,null,null,null,null,null,null,null,null,null,null,-1258906.33,{"$f":"'A5-Capex'!J59","v":992331.67},{"$f":"'A5-Capex'!K59","v":10353897.859999999},{"$f":"'A5-Capex'!L59","v":18580105}]
[{"$f":"'A5-Capex'!A60","v":"Waste water management"},null,null,2500000,null,null,4000000,null,null,null,3371289.1199999992,null,null,7638308.4900000002,{"$f":"'A5-Capex'!J60","v":17509597.609999999},{"$f":"'A5-Capex'!K60","v":8293989.29},{"$f":"'A5-Capex'!L60","v":2622000}]
[{"$f":"'A5-Capex'!A61","v":"Waste management"},null,null,null,null,null,null,null,null,null,null,null,null,0,{"$f":"'A5-Capex'!J61","v":0},{"$f":"'A5-Capex'!K61","v":0},{"$f":"'A5-Capex'!L61","v":0}]
[{"$f":"'A5-Capex'!A62","v":"Other"},null,7000,7000,7000,7000,7000,7000,7000,7000,7000,7000,7000,{"$f":"O24-SUM(C24:M24)","v":288912.76},{"$f":"'A5-Capex'!J62","v":365912.76},{"$f":"'A5-Capex'!K62","v":193691.89},{"$f":"'A5-Capex'!L62","v":239677.36402775999}]
[{"$f":"'A5-Capex'!A63","v":"Total Capital Expenditure - Standard"},2,{"$f":"C5+C9+C15+C19+C24","v":9628079.9199999999},{"$f":"D5+D9+D15+D19+D24","v":2840333},340333,340333,7540333,340333,340333,340333,7285271.1199999992,340333,340333,{"$f":"N5+N9+N15+N19+N24","v":3415564.7200000016},33091912.760000002,31995991.890000001,38276269.364027761]
[]
["Funded by:"]
["National Government",null,333333,12231312,333333,333333,10201991,333333,333333,333333,6711033,333333,333333,{"$f":"O28-SUM(C28:M28)","v":-719087.23999999836},{"$f":"'A5-Capex'!J66","v":31091912.760000002},{"$f":"'A5-Capex'!K66","v":29873991.890000001},{"$f":"'A5-Capex'!L66","v":36024827.364027761}]
["Provincial Government",null,null,null,null,null,null,null,null,null,null,null,null,{"$f":"O29-SUM(C29:M29)","v":0},{"$f":"'A5-Capex'!J67","v":0},{"$f":"'A5-Capex'!K67","v":0},{"$f":"'A5-Capex'!L67","v":0}]
["District Municipality",null,null,null,null,null,null,null,null,null,null,null,null,0,{"$f":"'A5-Capex'!J68","v":0},{"$f":"'A5-Capex'!K68","v":0},{"$f":"'A5-Capex'!L68","v":0}]
["Other transfers and grants",null,null,null,null,null,null,null,null,null,null,null,null,{"$f":"O31-SUM(C31:M31)","v":0},{"$f":"'A5-Capex'!J69","v":0},{"$f":"'A5-Capex'!K69","v":0},{"$f":"'A5-Capex'!L69","v":0}]
["Transfers recognised - capital",null,{"$f":"SUM(C28:C31)","v":333333},12231312,333333,333333,10201991,333333,333333,333333,6711033,333333,333333,{"$f":"SUM(N28:N31)","v":-719087.23999999836},31091912.760000002,29873991.890000001,36024827.364027761]
["Public contributions & donations",null,null,null,null,null,null,null,null,null,null,null,null,0,{"$f":"'A5-Capex'!J71","v":0},{"$f":"'A5-Capex'!K71","v":0},{"$f":"'A5-Capex'!L71","v":0}]
["Borrowing",null,null,null,null,null,null,null,null,null,null,null,null,0,{"$f":"'A5-Capex'!J72","v":0},{"$f":"'A5-Capex'!K72","v":0},{"$f":"'A5-Capex'!L72","v":0}]
["Internally generated funds",null,6000000,null,null,null,{"$f":"4946000+4911500","v":9857500},null,null,null,{"$f":"4600041.04+4911500","v":9511541.0399999991},null,null,-23369041.039999999,{"$f":"'A5-Capex'!J73","v":2000000},{"$f":"'A5-Capex'!K73","v":2122000},{"$f":"'A5-Capex'!L73","v":2251442}]
["Total Capital Funding",null,{"$f":"SUM(C32:C35)","v":6333333},12231312,333333,333333,20059491,333333,333333,333333,16222574.039999999,333333,333333,{"$f":"SUM(N32:N35)","v":-24088128.279999997},33091912.760000002,31995991.890000001,38276269.364027761]
[{"$f":"head27a","v":"References"}]
["1. Table should be completed as either Multi-Year expenditure appropriation or Budget Year and Forward Year estimates"]
[{"$f":"'SA28'!A44","v":"2. Total Capital Expenditure must reconcile to Budgeted Capital Expenditure"}]
["check"]

{"sheet":"SA30","index":50,"n_rows":64,"n_cols":19,"rows_kept":64,"cut":false,"hidden":false,"merged":[[1,13,1,15],[1,1,1,12],[57,0,57,15]]}
[{"$f":"muni&\" - \"& TableA30","v":"FS205 Mafube - Supporting Table SA30 Budgeted monthly cash flow"}]
["MONTHLY CASH FLOWS",{"$f":"Head9","v":"Budget Year 2017/18"},null,null,null,null,null,null,null,null,null,null,null,"Medium Term Revenue and Expenditure Framework"]
["R thousand","July","August","Sept.","October","November","December","January","February","March","April","May","June",{"$f":"Head9","v":"Budget Year 2017/18"},{"$f":"Head10","v":"Budget Year +1 2018/19"},{"$f":"Head11","v":"Budget Year +2 2019/20"}]
["Cash Receipts By Source",null,null,null,null,null,null,null,null,null,null,null,null,1]
[{"$f":"'A4-FinPerf RE'!A5","v":"Property rates"},2049543,2364536,2635475,1978697,1786978,2574758,2019203,1908980,2019302,2867586,1879687,{"$f":"N5-SUM(B5:L5)","v":4720227.9902600013},28804972.990260001,30562076.3426659,32426362.9995685,100001,100001,100001]
[{"$f":"'A4-FinPerf RE'!A6","v":"Property rates - penalties & collection charges"},null,null,null,null,null,null,null,null,null,null,null,0]
[{"$f":"'A4-FinPerf RE'!A7","v":"Service charges - electricity revenue"},null,null,null,null,null,null,null,null,null,null,null,0]
[{"$f":"'A4-FinPerf RE'!A8","v":"Service charges - water revenue"},589235,653212,585485,635214,458978,587548,542584,654565,545454,704510,523245,677634.24000000022,7157664.2400000002,7594281.7586399997,8057532.9459170401]
[{"$f":"'A4-FinPerf RE'!A9","v":"Service charges - sanitation revenue"},298754,254854,301542,285478,245744,235895,321412,301542,325141,325252,289787,294397.2799999998,3479798.28,3692065.9750799998,3917281.9995598798]
[{"$f":"'A4-FinPerf RE'!A10","v":"Service charges - refuse revenue"},205112,201454,222323,204141,207144,245744,325252,301542,285478,245744,235895,207772.4342857101,2887601.4342857101,3063745.1217771401,3250633.5742055401]
[{"$f":"'A4-FinPerf RE'!A11","v":"Service charges - other"},null,null,null,null,null,null,null,null,null,null,null,0]
[{"$f":"'A4-FinPerf RE'!A12","v":"Rental of facilities and equipment"},23521,24151,23223,24525,28745,29451,28414,27415,23223,23223,23521,29805.371886799985,309217.37188679999,328079.63157189498,348092.48909778002]
[{"$f":"'A4-FinPerf RE'!A13","v":"Interest earned - external investments"},32122,12000,2415,8796,32512,15212,15445,17545,11233,23525,35464,7973.9628000000084,214242.96280000001,227311.78353079999,241177.80232617899]
[{"$f":"'A4-FinPerf RE'!A14","v":"Interest earned - outstanding debtors"},2978695,1869785,2968594,1867585,2079786,2089708,1968594,1968594,2756475,1968594,2035243,2861225.2802879997,27412878.280288,29057650.977105301,30801110.035731599]
[{"$f":"'A4-FinPerf RE'!A15","v":"Dividends received"},295000,295000,295000,295000,295000,295000,295000,295000,295000,295000,295000,301177.81725999992,3546177.8172599999,3762494.6641128599,3992006.8386237398]
[{"$f":"'A4-FinPerf RE'!A16","v":"Fines"},6250,6250,6250,6250,6250,6250,6250,6250,6250,6250,6250,6250,75000,0,0]
[{"$f":"'A4-FinPerf RE'!A17","v":"Licences and permits"},null,null,null,null,null,null,null,null,null,null,null,0,0,0,0]
[{"$f":"'A4-FinPerf RE'!A18","v":"Agency services"},null,null,null,null,null,null,null,null,null,null,null,0]
["Transfer receipts - operational",32978697,1875000,930000,null,24079607,null,null,null,21660696,null,null,1648000,83172000,90157000,95121000]
[{"$f":"'A4-FinPerf RE'!A20","v":"Other revenue"},176758,176758,493059,176758,160800,176758,395848,176758,182747,176758,186978,52409.142261981964,2532389.142261982,2686865.4219400585,2850764.6826783419]
["Cash Receipts by Source",{"$f":"SUM(B5:B20)","v":39633687},7733000,8463366,5482444,29381544,6256324,5918002,5658191,28110999,6636442,5511070,10806873.519042492,159591942.51904249,171131571.67642397,181005963.36770859]
[]
["Other Cash Flows by Source"]
["Transfer receipts - capital",333333,12231312,333333,333333,10201991,333333,333333,333333,6711033,333333,333333,{"$f":"N24-SUM(B24:L24)","v":269000},32080000,30874000,37037000]
[{"$f":"'A4-FinPerf RE'!A40&\" & \"&'A4-FinPerf RE'!A41","v":"Contributions recognised - capital & Contributed assets"},null,null,null,null,null,null,null,null,null,null,null,0]
[{"$f":"'A7-CFlow'!A21","v":"Proceeds on disposal of PPE"},null,null,null,null,null,null,null,null,null,null,null,0]
[{"$f":"'A7-CFlow'!A31","v":"Short term loans"},null,null,null,null,null,null,null,null,null,null,null,0]
[{"$f":"'A7-CFlow'!A32","v":"Borrowing long term/refinancing"},null,null,null,null,null,null,null,null,null,null,null,0]
[{"$f":"'A7-CFlow'!A33","v":"Increase (decrease) in consumer deposits"},null,null,null,null,null,null,null,null,null,null,null,0]
[{"$f":"'A7-CFlow'!A22","v":"Decrease (Increase) in non-current debtors"},null,null,null,null,null,null,null,null,null,null,null,0]
[{"$f":"'A7-CFlow'!A23","v":"Decrease (increase) other non-current receivables"},null,null,null,null,null,null,null,null,null,null,null,0]
[{"$f":"'A7-CFlow'!A24","v":"Decrease (increase) in non-current investments"},null,null,null,null,null,null,null,null,null,null,null,0]
["Total Cash Receipts by Source",{"$f":"SUM(B21:B32)","v":39967020},19964312,8796699,5815777,39583535,6589657,6251335,5991524,34822032,6969775,5844403,11075873.519042492,191671942.51904249,202005571.67642397,218042963.36770859]
[]
["Cash Payments by Type"]
["Employee related costs",7149216.8670176677,7149216.8670176677,7149216.8670176677,7149216.8670176677,7149216.8670176677,7149216.8670176677,7149216.8670176677,7149216.8670176677,7149216.8670176677,7149216.8670176677,7149216.8670176677,{"$f":"N36-SUM(B36:L36)","v":7149216.8670176417},85790602.404212013,86648508.428254098,87514993.51253666]
["Remuneration of councillors",498773,498773,498773,498773,498773,498773,498773,498773,498773,498773,498773,498773.60440000053,5985276.6044000005,6045129.3704440007,6105580.6641484406]
["Finance charges",183423,183423,183423,183423,183423,183423,183423,183423,183423,183423,183423,1280419,3298072,3499254.392,3712708.9099119995]
["Bulk purchases - Electricity",2000000,null,null,null,null,null,null,null,2000000,null,null,0,4000000,6000000,8000000]
["Bulk purchases - Water & Sewer",1000000,null,null,null,null,null,null,null,1000000,null,null,0,2000000,2122000,3416420]
["Other materials",null,null,null,null,null,null,null,null,null,null,null,0]
["Contracted services",null,null,null,null,null,null,null,null,null,null,null,0]
["Transfers and grants - other municipalities",null,null,null,null,null,null,null,null,null,null,null,0]
["Transfers and grants - other",833333,833333,833333,833333,833333,833333,833333,833333,833333,833333,833333,833337,10000000,10610000,11257210]
["Other expenditure",9898888,1504950,2049392,1069594,4343222,3645363,3647564,1020101,18079695,1765555,1787766,5116434.9099999964,53928524.909999996,58891847.429509982,64412547.90771009]
["Cash Payments by Type",{"$f":"SUM(B36:B45)","v":21563633.867017668},10169695.867017668,10714137.867017668,9734339.8670176677,13007967.867017668,12310108.867017668,12312309.867017668,9684846.8670176677,29744440.867017668,10430300.867017668,10452511.867017668,14878181.38141764,{"$f":"SUM(N36:N45)","v":165002475.918612},173816739.62020808,{"$f":"SUM(P36:P45)","v":184419460.99430719}]
[]
["Other Cash Flows/Payments by Type"]
[{"$f":"'A7-CFlow'!A26","v":"Capital assets"},333333,{"$f":"10231312+619555","v":10850867},333333,333333,{"$f":"13401991+619555","v":14021546},333333,333333,333333,{"$f":"4311074","v":4311074},333333,333333,{"$f":"N49-SUM(B49:L49)","v":1241761.7575999945},33091912.757599995,31995991.885175999,38276269.364027761]
[{"$f":"'A7-CFlow'!A35","v":"Repayment of borrowing"},null,null,null,null,null,null,null,null,null,null,null,{"$f":"N50-SUM(B50:L50)","v":0}]
[{"$f":"LEFT(A48,25)","v":"Other Cash Flows/Payments"},null,null,null,null,null,null,null,null,null,null,null,{"$f":"N51-SUM(B51:L51)","v":0}]
["Total Cash Payments by Type",{"$f":"SUM(B46:B51)","v":21896966.867017668},{"$f":"SUM(C46:C51)","v":21020562.867017668},11047470.867017668,10067672.867017668,27029513.867017668,12643441.867017668,12645642.867017668,10018179.867017668,34055514.867017671,10763633.867017668,10785844.867017668,16119943.139017634,198094388.67621201,205812731.50538409,222695730.35833496,null,"Check"]
[]
["NET INCREASE/(DECREASE) IN CASH HELD",{"$f":"B33-B52","v":18070053.132982332},-1056250.8670176677,-2250771.8670176677,-4251895.8670176677,12554021.132982332,-6053784.8670176677,-6394307.8670176677,-4026655.8670176677,766517.13298232853,-3793858.8670176677,-4941441.8670176677,-5044069.6199751422,-6422446.1571695209,-3807159.8289601207,-4652766.9906263649]
["Cash/cash equivalents at the month/year begin:",null,{"$f":"B56","v":18070053.132982332},{"$f":"C56","v":17013802.265964665},14763030.398946997,10511134.531929329,23065155.664911661,17011370.797893994,10617062.930876326,6590407.0638586581,7356924.1968409866,3563065.3298233189,-1378376.5371943489,{"$f":"B55","v":0},{"$f":"N56","v":-6422446.1571695209},{"$f":"O56","v":-10229605.986129642}]
["Cash/cash equivalents at the month/year end:",{"$f":"B55+B54","v":18070053.132982332},{"$f":"C55+C54","v":17013802.265964665},{"$f":"D55+D54","v":14763030.398946997},10511134.531929329,23065155.664911661,17011370.797893994,10617062.930876326,6590407.0638586581,7356924.1968409866,3563065.3298233189,-1378376.5371943489,-6422446.1571694911,-6422446.1571695209,-10229605.986129642,-14882372.976756006]
[{"$f":"head27a","v":"References"}]
["1. Note that this section of Table SA 30 is deliberately not linked to Table A4 because timing differences between the invoicing of clients and receiving the cash means that the cashflow will differ from budgeted revenue, and similarly for budgeted expenditure. However for the MTREF it is now directly linked to A7."]
[]
[]
[]
[]
[null,null,null,null,{"$f":"E46+E62","v":9734339.8670176677},13007967.867017668,12310108.867017668,12312309.867017668,9684846.8670176677,29744440.867017668,10430300.867017668,10452511.867017668,14878181.38141764,165002475.918612,173816739.62020808,184419460.99430719]
[null,null,null,null,{"$f":"E54-E62","v":-4251895.8670176677},12554021.132982332,-6053784.8670176677,-6394307.8670176677,-4026655.8670176677,766517.13298232853,-3793858.8670176677,-4941441.8670176677,-5044069.6199751422,-6422446.1571695209,-3807159.8289601207,-4652766.9906263649]

{"sheet":"SA31","index":51,"n_rows":41,"n_cols":11,"rows_kept":41,"cut":false,"hidden":false,"merged":[[1,5,1,7],[1,8,1,10],[1,1,2,1]]}
[{"$f":"muni&\" - \"& TableA31","v":"FS205 Mafube - NOT REQUIRED - municipality does not have entities"}]
[{"$f":"desc","v":"Description"},{"$f":"head27","v":"Ref"},{"$f":"head1b","v":"2013/14"},{"$f":"head1A","v":"2014/15"},{"$f":"Head1","v":"2015/16"},{"$f":"Head2","v":"Current Year 2016/17"},null,null,{"$f":"Head3","v":"2017/18 Medium Term Revenue & Expenditure Framework"}]
["R million",null,{"$f":"Head5","v":"Audited Outcome"},{"$f":"Head5","v":"Audited Outcome"},{"$f":"Head5","v":"Audited Outcome"},{"$f":"Head6","v":"Original Budget"},{"$f":"Head7","v":"Adjusted Budget"},{"$f":"Head8","v":"Full Year Forecast"},{"$f":"Head9","v":"Budget Year 2017/18"},{"$f":"Head10","v":"Budget Year +1 2018/19"},{"$f":"Head11","v":"Budget Year +2 2019/20"}]
["Financial Performance"]
[{"$f":"'A1-Sum'!A5","v":"Property rates"}]
[{"$f":"'A1-Sum'!A6","v":"Service charges"}]
[{"$f":"'A1-Sum'!A7","v":"Investment revenue"}]
[{"$f":"'A1-Sum'!A8","v":"Transfers recognised - operational"}]
[{"$f":"'A1-Sum'!A9","v":"Other own revenue"}]
[{"$f":"'A1-Sum'!A21","v":"Contributions recognised - capital & contributed assets"}]
[{"$f":"'A4-FinPerf RE'!A22","v":"Total Revenue (excluding capital transfers and contributions)"},null,{"$f":"SUM(C5:C10)","v":0},{"$f":"SUM(D5:D10)","v":0},{"$f":"SUM(E5:E10)","v":0},0,0,0,0,0,0]
[{"$f":"'A1-Sum'!A11","v":"Employee costs"}]
["Remuneration of Board Members"]
[{"$f":"'A1-Sum'!A13","v":"Depreciation & asset impairment"}]
[{"$f":"'A1-Sum'!A14","v":"Finance charges"}]
[{"$f":"'A1-Sum'!A15","v":"Materials and bulk purchases"}]
[{"$f":"'A1-Sum'!A16","v":"Transfers and grants"}]
[{"$f":"'A1-Sum'!A17","v":"Other expenditure"}]
[{"$f":"'A4-FinPerf RE'!A36","v":"Total Expenditure"},null,{"$f":"SUM(C12:C18)","v":0},{"$f":"SUM(D12:D18)","v":0},0,0,0,0,0,0,0]
[{"$f":"'A4-FinPerf RE'!A38","v":"Surplus/(Deficit)"},null,{"$f":"C11-C19","v":0},{"$f":"D11-D19","v":0},0,0,0,0,0,0,0]
[]
["Capital expenditure & funds sources"]
["Capital expenditure"]
[{"$f":"A8","v":"Transfers recognised - operational"}]
[{"$f":"'A5-Capex'!A71","v":"Public contributions & donations"}]
[{"$f":"'A5-Capex'!A72","v":"Borrowing"}]
[{"$f":"'A5-Capex'!A73","v":"Internally generated funds"}]
["Total sources",null,{"$f":"SUM(C24:C27)","v":0},0,0,0,0,0,0,0,0]
[]
["Financial position"]
[{"$f":"'A6-FinPos'!A12","v":"Total current assets"}]
[{"$f":"'A6-FinPos'!A24","v":"Total non current assets"}]
[{"$f":"'A6-FinPos'!A34","v":"Total current liabilities"}]
[{"$f":"'A6-FinPos'!A39","v":"Total non current liabilities"}]
["Equity"]
[]
["Cash flows"]
[{"$f":"'A1-Sum'!A42","v":"Net cash from (used) operating"}]
[{"$f":"'A1-Sum'!A43","v":"Net cash from (used) investing"}]
[{"$f":"'A1-Sum'!A44","v":"Net cash from (used) financing"}]
[{"$f":"'A1-Sum'!A45","v":"Cash/cash equivalents at the year end"}]

{"sheet":"SA32","index":52,"n_rows":27,"n_cols":6,"rows_kept":27,"cut":false,"hidden":false,"merged":[[1,3,2,3],[1,4,2,4],[1,1,2,1]]}
[{"$f":"muni&\" - \"&TableA32","v":"FS205 Mafube - Supporting Table SA32 List of external mechanisms"}]
["External mechanism","Yrs/ Mths","Period of agreement 1.","Service provided","Expiry date of service delivery agreement or contract","Monetary value of agreement 2."]
["Name of organisation",null,"Number",null,null,"R thousand"]
["Rural Maintenance",null,25,"Electricity Supply","2037-02-01",800000000]
[]
[]
[]
[]
[]
[]
[]
[]
[]
[]
[]
[]
[]
[]
[]
[]
[]
[]
[]
[]
[{"$f":"head27a","v":"References"}]
["1. Total agreement period from commencement until end"]
["2. Annual value"]

{"sheet":"SA33","index":53,"n_rows":48,"n_cols":15,"rows_kept":48,"cut":false,"hidden":false,"merged":[[1,4,1,6],[47,0,47,13]]}
[{"$f":"muni&\" - \"& TableA33","v":"FS205 Mafube - Supporting Table SA33 Contracts having future budgetary implications"}]
[{"$f":"desc","v":"Description"},{"$f":"head27","v":"Ref"},"Preceding Years",{"$f":"Head2","v":"Current Year 2016/17"},{"$f":"Head3","v":"2017/18 Medium Term Revenue & Expenditure Framework"},null,null,{"$f":"Head12","v":"Forecast 2020/21"},{"$f":"Head13","v":"Forecast 2021/22"},{"$f":"Head14","v":"Forecast 2022/23"},{"$f":"Head15","v":"Forecast 2023/24"},{"$f":"Head16","v":"Forecast 2024/25"},{"$f":"Head17","v":"Forecast 2025/26"},{"$f":"Head18","v":"Forecast 2026/27"},"Total Contract Value"]
["R thousand","1,3","Total",{"$f":"Head6","v":"Original Budget"},{"$f":"Head9","v":"Budget Year 2017/18"},{"$f":"Head10","v":"Budget Year +1 2018/19"},{"$f":"Head11","v":"Budget Year +2 2019/20"},"Estimate","Estimate","Estimate","Estimate","Estimate","Estimate","Estimate","Estimate"]
["Parent Municipality:"]
["Revenue Obligation By Contract",2]
["Contract 1",null,null,null,null,null,null,null,null,null,null,null,null,null,{"$f":"SUM(C6:N6)","v":0}]
["Contract 2",null,null,null,null,null,null,null,null,null,null,null,null,null,{"$f":"SUM(C7:N7)","v":0}]
["Contract 3 etc",null,null,null,null,null,null,null,null,null,null,null,null,null,{"$f":"SUM(C8:N8)","v":0}]
["Total Operating Revenue Implication",null,{"$f":"SUM(C6:C8)","v":0},{"$f":"SUM(D6:D8)","v":0},0,0,0,0,0,0,0,0,0,0,{"$f":"SUM(C9:N9)","v":0}]
[]
["Expenditure Obligation By Contract",2]
["Contract 1",null,null,null,null,null,null,null,null,null,null,null,null,null,{"$f":"SUM(C12:N12)","v":0}]
["Contract 2",null,null,null,null,null,null,null,null,null,null,null,null,null,{"$f":"SUM(C13:N13)","v":0}]
["Contract 3 etc",null,null,null,null,null,null,null,null,null,null,null,null,null,{"$f":"SUM(C14:N14)","v":0}]
["Total Operating Expenditure Implication",null,{"$f":"SUM(C12:C14)","v":0},0,0,0,0,0,0,0,0,0,0,0,{"$f":"SUM(C15:N15)","v":0}]
[]
["Capital Expenditure Obligation By Contract",2]
["Contract 1",null,null,null,null,null,null,null,null,null,null,null,null,null,{"$f":"SUM(C18:N18)","v":0}]
["Contract 2",null,null,null,null,null,null,null,null,null,null,null,null,null,{"$f":"SUM(C19:N19)","v":0}]
["Contract 3 etc",null,null,null,null,null,null,null,null,null,null,null,null,null,{"$f":"SUM(C20:N20)","v":0}]
["Total Capital Expenditure Implication",null,{"$f":"SUM(C18:C20)","v":0},0,0,0,0,0,0,0,0,0,0,0,{"$f":"SUM(C21:N21)","v":0}]
[]
["Total Parent Expenditure Implication",null,{"$f":"C15+C21","v":0},{"$f":"D15+D21","v":0},0,0,0,0,0,0,0,0,0,0,0]
[]
["Entities:"]
["Revenue Obligation By Contract",2]
["Contract 1",null,null,null,null,null,null,null,null,null,null,null,null,null,{"$f":"SUM(C27:N27)","v":0}]
["Contract 2",null,null,null,null,null,null,null,null,null,null,null,null,null,{"$f":"SUM(C28:N28)","v":0}]
["Contract 3 etc",null,null,null,null,null,null,null,null,null,null,null,null,null,{"$f":"SUM(C29:N29)","v":0}]
["Total Operating Revenue Implication",null,{"$f":"SUM(C27:C29)","v":0},0,0,0,0,0,0,0,0,0,0,0,{"$f":"SUM(C30:N30)","v":0}]
[]
["Expenditure Obligation By Contract",2]
["Contract 1",null,null,null,null,null,null,null,null,null,null,null,null,null,{"$f":"SUM(C33:N33)","v":0}]
["Contract 2",null,null,null,null,null,null,null,null,null,null,null,null,null,{"$f":"SUM(C34:N34)","v":0}]
["Contract 3 etc",null,null,null,null,null,null,null,null,null,null,null,null,null,{"$f":"SUM(C35:N35)","v":0}]
["Total Operating Expenditure Implication",null,{"$f":"SUM(C33:C35)","v":0},0,0,0,0,0,0,0,0,0,0,0,{"$f":"SUM(C36:N36)","v":0}]
[]
["Capital Expenditure Obligation By Contract",2]
["Contract 1",null,null,null,null,null,null,null,null,null,null,null,null,null,{"$f":"SUM(C39:N39)","v":0}]
["Contract 2",null,null,null,null,null,null,null,null,null,null,null,null,null,{"$f":"SUM(C40:N40)","v":0}]
["Contract 3 etc",null,null,null,null,null,null,null,null,null,null,null,null,null,{"$f":"SUM(C41:N41)","v":0}]
["Total Capital Expenditure Implication",null,{"$f":"SUM(C39:C41)","v":0},0,0,0,0,0,0,0,0,0,0,0,{"$f":"SUM(C42:N42)","v":0}]
[]
["Total Entity Expenditure Implication",null,{"$f":"C36+C42","v":0},{"$f":"D36+D42","v":0},0,0,0,0,0,0,0,0,0,0,0]
[{"$f":"head27a","v":"References"}]
["1. Total implication for all preceding years to be summed and total stated in 'Preceding Years' column"]
["2. List all contracts with future financial obligations beyond the three years covered by the MTREF (MFMA s33)"]
["3. For municipalities with approved total revenue not exceeding R250 m - all contracts with an annual cost greater than R500 000. For municipalities with approved total revenue greater than R250 m - all contracts with an annual cost greater than R1million. For municipalities with approved total revenue greater than R500 m - all contracts with an annual cost greater than R5 million"]

{"sheet":"SA34a","index":54,"n_rows":97,"n_cols":11,"rows_kept":97,"cut":false,"hidden":false,"merged":[[1,5,1,7],[1,8,1,10]]}
[{"$f":"muni&\" - \"&TableA34a","v":"FS205 Mafube - Supporting Table SA34a Capital expenditure on new assets by asset class"}]
[{"$f":"desc","v":"Description"},{"$f":"head27","v":"Ref"},{"$f":"head1b","v":"2013/14"},{"$f":"head1A","v":"2014/15"},{"$f":"Head1","v":"2015/16"},{"$f":"Head2","v":"Current Year 2016/17"},null,null,{"$f":"Head3","v":"2017/18 Medium Term Revenue & Expenditure Framework"}]
["R thousand",1,{"$f":"Head5","v":"Audited Outcome"},{"$f":"Head5","v":"Audited Outcome"},{"$f":"Head5","v":"Audited Outcome"},{"$f":"Head6","v":"Original Budget"},{"$f":"Head7","v":"Adjusted Budget"},{"$f":"Head8","v":"Full Year Forecast"},{"$f":"Head9","v":"Budget Year 2017/18"},{"$f":"Head10","v":"Budget Year +1 2018/19"},{"$f":"Head11","v":"Budget Year +2 2019/20"}]
["Capital expenditure on new assets by Asset Class/Sub-class"]
[]
["Infrastructure",null,{"$f":"C7+C10+C14+C18+C21","v":24010930},12656687,7829391,33114726,33114726,33114726,23867842.037599999,28799661.885175999,34898162.364027761]
["Infrastructure - Road transport",null,{"$f":"SUM(C8:C9)","v":0},{"$f":"SUM(D8:D9)","v":0},0,0,0,0,0,2958082.85,1456380]
["Roads, Pavements & Bridges",null,0,null,null,null,null,null,null,0,0]
["Storm water",null,null,null,null,null,null,null,null,2958082.85,1456380]
["Infrastructure - Electricity",null,{"$f":"SUM(C11:C13)","v":0},{"$f":"SUM(D11:D13)","v":0},0,14000000,14000000,14000000,5000000,7000000,12000000]
["Generation"]
["Transmission & Reticulation",null,0,null,null,8000000,8000000,8000000,5000000,7000000,12000000]
["Street Lighting",null,null,null,null,6000000,6000000,6000000]
["Infrastructure - Water",null,{"$f":"SUM(C15:C17)","v":0},{"$f":"SUM(D15:D17)","v":0},0,2251238,2251238,2251238,992331.67,10353897.859999999,18580105]
["Dams & Reservoirs",null,0,0,0,2251238,2251238,2251238,757594.63,10193897.859999999,18580105]
["Water purification",null,null,null,null,null,null,null,null,0,0]
["Reticulation",null,null,null,null,null,null,null,234737.04,160000,0]
["Infrastructure - Sanitation",null,{"$f":"SUM(C19:C20)","v":0},0,0,16772753,16772753,16772753,17509597.609999999,8293989.29,2622000]
["Reticulation"]
["Sewerage purification",null,0,null,null,16772753,16772753,16772753,17509597.609999999,8293989.29,2622000]
["Infrastructure - Other",null,{"$f":"SUM(C22:C25)","v":24010930},{"$f":"SUM(D22:D25)","v":12656687},7829391,90735,90735,90735,365912.75760000001,193691.88517599995,239677.36402775999]
["Waste Management"]
["Transportation",2]
["Gas"]
["Other",3,24010930,12656687,7829391,90735,90735,90735,365912.75760000001,193691.88517599995,239677.36402775999]
[]
["Community",null,{"$f":"SUM(C28:C41)","v":1528209},{"$f":"SUM(D28:D41)","v":789220},222400,1500000,1500000,1500000,0,0,0]
["Parks & gardens"]
["Sportsfields & stadia"]
["Swimming pools"]
["Community halls"]
["Libraries"]
["Recreational facilities"]
["Fire, safety & emergency"]
["Security and policing"]
["Buses",7]
["Clinics"]
["Museums & Art Galleries"]
["Cemeteries"]
["Social rental housing",8]
["Other",null,1528209,789220,222400,1500000,1500000,1500000]
[]
["Heritage assets",null,{"$f":"SUM(C44:C45)","v":0},{"$f":"SUM(D44:D45)","v":0},0,0,0,0,0,0,0]
["Buildings"]
["Other",9]
[]
["Investment properties",null,{"$f":"SUM(C48:C49)","v":0},{"$f":"SUM(D48:D49)","v":0},0,0,0,0,0,0,0]
["Housing development"]
["Other"]
[]
["Other assets",null,{"$f":"SUM(C52:C63)","v":102885},{"$f":"SUM(D52:D63)","v":636747},980124,3290000,3290000,3290000,0,0,0]
["General vehicles",null,null,null,null,0,0]
["Specialised vehicles",10,{"$f":"C79","v":0},{"$f":"D79","v":0},0,0,0,0,0,0,0]
["Plant & equipment"]
["Computers - hardware/equipment"]
["Furniture and other office equipment"]
["Abattoirs"]
["Markets"]
["Civic Land and Buildings"]
["Other Buildings"]
["Other Land"]
["Surplus Assets - (Investment or Inventory)"]
["Other",null,102885,636747,980124,3290000,3290000,3290000]
[]
["Agricultural assets",null,{"$f":"SUM(C66:C67)","v":0},{"$f":"SUM(D66:D67)","v":0},0,0,0,0,0,0,0]
["List sub-class"]
[]
[]
["Biological assets",null,{"$f":"SUM(C70:C71)","v":0},{"$f":"SUM(D70:D71)","v":0},0,0,0,0,0,0,0]
["List sub-class"]
[]
[]
["Intangibles",null,{"$f":"SUM(C74:C75)","v":0},{"$f":"SUM(D74:D75)","v":0},0,1700000,1700000,1700000,2000000,2122000,2251442]
["Computers - software & programming",null,null,null,null,1700000,1700000,1700000,2000000,2122000,2251442]
["Other (list sub-class)"]
[]
["Total Capital Expenditure on new assets",1,{"$f":"C6+C27+C43+C47+C51+C73+C65+C69","v":25642024},14082654,9031915,39604726,39604726,39604726,25867842.037599999,30921661.885175999,37149604.364027761]
[]
["Specialised vehicles",null,{"$f":"SUM(C80:C83)","v":0},0,0,0,0,0,0,0,0]
["Refuse"]
["Fire"]
["Conservancy"]
["Ambulances"]
[{"$f":"head27a","v":"References"}]
["1. Total Capital Expenditure on new assets (SA34a) plus Total Capital Expenditure on renewal of existing assets (SA34b) must reconcile to total capital expenditure in Budgeted Capital Expenditure"]
["2. Airports, Car Parks, Bus Terminals and Taxi Ranks"]
["3. For example - technology backbones (e.g. fibre optic, WIFI infrastructure) for economic development purposes"]
["4. Work-in-progress/under construction to be budgeted under the respective item"]
["5. Infrastructure includes 'land and buildings required' by that infrastructure and vehicles/plant & equipment used by the service generated by that infrastructure"]
["6. Donated/contributed & leased assets to be included within the respective sub-class"]
["7. Busses used to provide a service to the community"]
["8. Not municipal contributions to the 'top structure' being built using the housing subsidies"]
["9. Statues, art collections, medals etc."]
["10. Ambulances, fire engines, refuse vehicles - but not vehicles that would normally be classified as 'Plant and equipment'"]
[]
[]
["check balance",null,{"$f":"SUM(C77+SA34b!C77)-'A5-Capex'!C40","v":0},{"$f":"SUM(D77+SA34b!D77)-'A5-Capex'!D40","v":0},{"$f":"SUM(E77+SA34b!E77)-'A5-Capex'!E40","v":0},{"$f":"SUM(F77+SA34b!F77)-'A5-Capex'!F40","v":0},{"$f":"SUM(G77+SA34b!G77)-'A5-Capex'!G40","v":-180000},{"$f":"SUM(H77+SA34b!H77)-'A5-Capex'!H40","v":41931635},{"$f":"SUM(I77+SA34b!I77)-'A5-Capex'!J40","v":0},{"$f":"SUM(J77+SA34b!J77)-'A5-Capex'!K40","v":0},{"$f":"SUM(K77+SA34b!K77)-'A5-Capex'!L40","v":0}]

{"sheet":"SA34b","index":55,"n_rows":100,"n_cols":11,"rows_kept":100,"cut":false,"hidden":false,"merged":[[1,5,1,7],[1,8,1,10]]}
[{"$f":"muni&\" - \"&TableA34b","v":"FS205 Mafube - Supporting Table SA34b Capital expenditure on the renewal of existing assets by asset class"}]
[{"$f":"desc","v":"Description"},{"$f":"head27","v":"Ref"},{"$f":"head1b","v":"2013/14"},{"$f":"head1A","v":"2014/15"},{"$f":"Head1","v":"2015/16"},{"$f":"Head2","v":"Current Year 2016/17"},null,null,{"$f":"Head3","v":"2017/18 Medium Term Revenue & Expenditure Framework"}]
["R thousand",1,{"$f":"Head5","v":"Audited Outcome"},{"$f":"Head5","v":"Audited Outcome"},{"$f":"Head5","v":"Audited Outcome"},{"$f":"Head6","v":"Original Budget"},{"$f":"Head7","v":"Adjusted Budget"},{"$f":"Head8","v":"Full Year Forecast"},{"$f":"Head9","v":"Budget Year 2017/18"},{"$f":"Head10","v":"Budget Year +1 2018/19"},{"$f":"Head11","v":"Budget Year +2 2019/20"}]
["Capital expenditure on renewal of existing assets by Asset Class/Sub-class"]
[]
["Infrastructure",null,{"$f":"C7+C10+C14+C18+C21","v":0},{"$f":"D7+D10+D14+D18+D21","v":0},0,0,0,0,0,0,0]
["Infrastructure - Road transport",null,{"$f":"SUM(C8:C9)","v":0},{"$f":"SUM(D8:D9)","v":0},0,0,0,0,0,0,0]
["Roads, Pavements & Bridges"]
["Storm water"]
["Infrastructure - Electricity",null,{"$f":"SUM(C11:C13)","v":0},{"$f":"SUM(D11:D13)","v":0},0,0,0,0,0,0,0]
["Generation"]
["Transmission & Reticulation"]
["Street Lighting"]
["Infrastructure - Water",null,{"$f":"SUM(C15:C17)","v":0},{"$f":"SUM(D15:D17)","v":0},0,0,0,0,0,0,0]
["Dams & Reservoirs"]
["Water purification"]
["Reticulation"]
["Infrastructure - Sanitation",null,{"$f":"SUM(C19:C20)","v":0},0,0,0,0,0,0,0,0]
["Reticulation"]
["Sewerage purification"]
["Infrastructure - Other",null,{"$f":"SUM(C22:C25)","v":0},{"$f":"SUM(D22:D25)","v":0},0,0,0,0,0,0,0]
["Waste Management"]
["Transportation",2]
["Gas"]
["Other",3]
[]
["Community",null,{"$f":"SUM(C28:C41)","v":0},{"$f":"SUM(D28:D41)","v":0},0,2326909,2326909,2326909,7224070.7199999997,1074330,1126665]
["Parks & gardens"]
["Sportsfields & stadia",null,null,null,null,2326909,2326909,2326909,7224070.7199999997,1074330,1126665]
["Swimming pools"]
["Community halls"]
["Libraries"]
["Recreational facilities"]
["Fire, safety & emergency"]
["Security and policing"]
["Buses",7]
["Clinics"]
["Museums & Art Galleries"]
["Cemeteries"]
["Social rental housing",8]
["Other"]
[]
["Heritage assets",null,{"$f":"SUM(C44:C45)","v":0},{"$f":"SUM(D44:D45)","v":0},0,0,0,0,0,0,0]
["Buildings"]
["Other",9]
[]
["Investment properties",null,{"$f":"SUM(C48:C49)","v":0},{"$f":"SUM(D48:D49)","v":0},0,0,0,0,0,0,0]
["Housing development"]
["Other"]
[]
["Other assets",null,{"$f":"SUM(C52:C63)","v":0},{"$f":"SUM(D52:D63)","v":0},0,0,0,0,0,0,0]
["General vehicles"]
["Specialised vehicles",10,{"$f":"C79","v":0},{"$f":"D79","v":0},0,0,0,0,0,0,0]
["Plant & equipment"]
["Computers - hardware/equipment"]
["Furniture and other office equipment"]
["Abattoirs"]
["Markets"]
["Civic Land and Buildings"]
["Other Buildings"]
["Other Land"]
["Surplus Assets - (Investment or Inventory)"]
["Other"]
[]
["Agricultural assets",null,{"$f":"SUM(C66:C67)","v":0},{"$f":"SUM(D66:D67)","v":0},0,0,0,0,0,0,0]
["List sub-class"]
[]
[]
["Biological assets",null,{"$f":"SUM(C70:C71)","v":0},{"$f":"SUM(D70:D71)","v":0},0,0,0,0,0,0,0]
["List sub-class"]
[]
[]
["Intangibles",null,{"$f":"SUM(C74:C75)","v":0},{"$f":"SUM(D74:D75)","v":0},0,0,0,0,0,0,0]
["Computers - software & programming"]
["Other (list sub-class)"]
[]
["Total Capital Expenditure on renewal of existing assets ",1,{"$f":"C6+C27+C43+C47+C51+C73+C65+C69","v":0},0,0,2326909,2326909,2326909,7224070.7199999997,1074330,1126665]
[]
["Specialised vehicles",null,{"$f":"SUM(C80:C83)","v":0},0,0,0,0,0,0,0,0]
["Refuse"]
["Fire"]
["Conservancy"]
["Ambulances"]
[]
["Renewal of Existing Assets as % of total capex",null,{"$f":"IF(ISERROR(C77/'A9-Asset'!C49),0,(C77/'A9-Asset'!C49))","v":0},{"$f":"IF(ISERROR(D77/'A9-Asset'!D49),0,(D77/'A9-Asset'!D49))","v":0},{"$f":"IF(ISERROR(E77/'A9-Asset'!E49),0,(E77/'A9-Asset'!E49))","v":0},{"$f":"IF(ISERROR(F77/'A9-Asset'!F49),0,(F77/'A9-Asset'!F49))","v":5.5492923183176619E-2},{"$f":"IF(ISERROR(G77/'A9-Asset'!G49),0,(G77/'A9-Asset'!G49))","v":5.5492923183176619E-2},{"$f":"IF(ISERROR(H77/'A9-Asset'!H49),0,(H77/'A9-Asset'!H49))","v":5.5492923183176619E-2},{"$f":"IF(ISERROR(I77/'A9-Asset'!I49),0,(I77/'A9-Asset'!I49))","v":0.21830320818614196},{"$f":"IF(ISERROR(J77/'A9-Asset'!J49),0,(J77/'A9-Asset'!J49))","v":3.3577018142005019E-2},{"$f":"IF(ISERROR(K77/'A9-Asset'!K49),0,(K77/'A9-Asset'!K49))","v":2.9435078671978563E-2}]
["Renewal of Existing Assets as % of deprecn\"",null,{"$f":"IF(ISERROR(C77/'A9-Asset'!C68),0,(C77/'A9-Asset'!C68))","v":0},{"$f":"IF(ISERROR(D77/'A9-Asset'!D68),0,(D77/'A9-Asset'!D68))","v":0},{"$f":"IF(ISERROR(E77/'A9-Asset'!E68),0,(E77/'A9-Asset'!E68))","v":0},{"$f":"IF(ISERROR(F77/'A9-Asset'!F68),0,(F77/'A9-Asset'!F68))","v":1.5512726666666667},{"$f":"IF(ISERROR(G77/'A9-Asset'!G68),0,(G77/'A9-Asset'!G68))","v":1.5512726666666667},{"$f":"IF(ISERROR(H77/'A9-Asset'!H68),0,(H77/'A9-Asset'!H68))","v":1.5512726666666667},{"$f":"IF(ISERROR(I77/'A9-Asset'!I68),0,(I77/'A9-Asset'!I68))","v":0.18881929216616447},{"$f":"IF(ISERROR(J77/'A9-Asset'!J68),0,(J77/'A9-Asset'!J68))","v":2.8080321748687902E-2},{"$f":"IF(ISERROR(K77/'A9-Asset'!K68),0,(K77/'A9-Asset'!K68))","v":2.9448228852387494E-2}]
[{"$f":"head27a","v":"References"}]
["1. Total Capital Expenditure  on renewal of existing assets (SA34b) plus Total Capital Expenditure on new assets (SA34a) must reconcile to total capital expenditure in Budgeted Capital Expenditure"]
["2. Airports, Car Parks, Bus Terminals and Taxi Ranks"]
["3. For example - technology backbones (e.g. fibre optic, WIFI infrastructure) for economic development purposes"]
["4. Work-in-progress/under construction to be budgeted under the respective item"]
["5. Infrastructure includes 'land and buildings required' by that infrastructure and vehicles/plant & equipment used by the service generated by that infrastructure"]
["6. Donated/contributed & leased assets to be included within the respective sub-class"]
["7. Busses used to provide a service to the community"]
["8. Not municipal contributions to the 'top structure' being built using the housing subsidies"]
["9. Statues, art collections, medals etc."]
["10. Ambulances, fire engines, refuse vehicles - but not vehicles that would normally be classified as 'Plant and equipment'"]
[]
[]
["check balance",null,{"$f":"SUM(C77+SA34a!C77)-'A5-Capex'!C40","v":0},{"$f":"SUM(D77+SA34a!D77)-'A5-Capex'!D40","v":0},{"$f":"SUM(E77+SA34a!E77)-'A5-Capex'!E40","v":0},{"$f":"SUM(F77+SA34a!F77)-'A5-Capex'!F40","v":0},{"$f":"SUM(G77+SA34a!G77)-'A5-Capex'!G40","v":-180000},{"$f":"SUM(H77+SA34a!H77)-'A5-Capex'!H40","v":41931635},{"$f":"SUM(I77+SA34a!I77)-'A5-Capex'!J40","v":0},{"$f":"SUM(J77+SA34a!J77)-'A5-Capex'!K40","v":0},{"$f":"SUM(K77+SA34a!K77)-'A5-Capex'!L40","v":0}]

{"sheet":"SA34c","index":56,"n_rows":100,"n_cols":11,"rows_kept":100,"cut":false,"hidden":false,"merged":[[1,5,1,7],[1,8,1,10]]}
[{"$f":"muni&\" - \"&TableA34c","v":"FS205 Mafube - Supporting Table SA34c Repairs and maintenance expenditure by asset class"}]
[{"$f":"desc","v":"Description"},{"$f":"head27","v":"Ref"},{"$f":"head1b","v":"2013/14"},{"$f":"head1A","v":"2014/15"},{"$f":"Head1","v":"2015/16"},{"$f":"Head2","v":"Current Year 2016/17"},null,null,{"$f":"Head3","v":"2017/18 Medium Term Revenue & Expenditure Framework"}]
["R thousand",1,{"$f":"Head5","v":"Audited Outcome"},{"$f":"Head5","v":"Audited Outcome"},{"$f":"Head5","v":"Audited Outcome"},{"$f":"Head6","v":"Original Budget"},{"$f":"Head7","v":"Adjusted Budget"},{"$f":"Head8","v":"Full Year Forecast"},{"$f":"Head9","v":"Budget Year 2017/18"},{"$f":"Head10","v":"Budget Year +1 2018/19"},{"$f":"Head11","v":"Budget Year +2 2019/20"}]
["Repairs and maintenance expenditure by Asset Class/Sub-class"]
[]
["Infrastructure",null,{"$f":"C7+C10+C14+C18+C21","v":0},{"$f":"D7+D10+D14+D18+D21","v":32876183},0,0,0,0,6925255,9526695,11651299.5]
["Infrastructure - Road transport",null,{"$f":"SUM(C8:C9)","v":0},{"$f":"SUM(D8:D9)","v":0},0,0,0,0,500000,530500,562860.5]
["Roads, Pavements & Bridges",null,null,null,null,null,null,null,500000,530500,562860.5]
["Storm water"]
["Infrastructure - Electricity",null,{"$f":"SUM(C11:C13)","v":0},{"$f":"SUM(D11:D13)","v":0},0,0,0,0,0,0,0]
["Generation"]
["Transmission & Reticulation"]
["Street Lighting"]
["Infrastructure - Water",null,{"$f":"SUM(C15:C17)","v":0},{"$f":"SUM(D15:D17)","v":0},0,0,0,0,1425255,1512195,1604439]
["Dams & Reservoirs"]
["Water purification"]
["Reticulation",null,null,null,null,null,null,null,1425255,1512195,1604439]
["Infrastructure - Sanitation",null,{"$f":"SUM(C19:C20)","v":0},0,0,0,0,0,5000000,7484000,9484000]
["Reticulation"]
["Sewerage purification",null,null,null,null,null,null,null,5000000,7484000,9484000]
["Infrastructure - Other",null,{"$f":"SUM(C22:C25)","v":0},{"$f":"SUM(D22:D25)","v":32876183},0,0,0,0,0,0,0]
["Waste Management"]
["Transportation",2]
["Gas"]
["Other",3,null,32876183]
[]
["Community",null,{"$f":"SUM(C28:C41)","v":11206908},{"$f":"SUM(D28:D41)","v":0},0,570000,570000,570000,200000,212200,225144.19999999998]
["Parks & gardens",null,null,null,null,null,null,null,50000,53050,56286.049999999996]
["Sportsfields & stadia"]
["Swimming pools"]
["Community halls"]
["Libraries"]
["Recreational facilities"]
["Fire, safety & emergency",null,null,null,null,null,null,null,150000,159150,168858.15]
["Security and policing"]
["Buses",7]
["Clinics"]
["Museums & Art Galleries"]
["Cemeteries"]
["Social rental housing",8]
["Other",null,11206908,null,null,570000,570000,570000]
[]
["Heritage assets",null,{"$f":"SUM(C44:C45)","v":0},{"$f":"SUM(D44:D45)","v":0},0,0,0,0,0,0,0]
["Buildings"]
["Other",9]
[]
["Investment properties",null,{"$f":"SUM(C48:C49)","v":0},{"$f":"SUM(D48:D49)","v":0},0,0,0,0,0,0,0]
["Housing development"]
["Other"]
[]
["Other assets",null,{"$f":"SUM(C52:C63)","v":0},{"$f":"SUM(D52:D63)","v":0},0,13315000,13315000,13315000,11075254.91,10937047.460000001,12029316.58]
["General vehicles",null,null,null,null,null,null,null,2000000,2122000,2251442]
["Specialised vehicles",10,{"$f":"C79","v":0},{"$f":"D79","v":0},0,0,0,0,0,0,0]
["Plant & equipment"]
["Computers - hardware/equipment"]
["Furniture and other office equipment"]
["Abattoirs"]
["Markets"]
["Civic Land and Buildings"]
["Other Buildings",null,null,null,null,null,null,null,200000,212200,225144]
["Other Land"]
["Surplus Assets - (Investment or Inventory)"]
["Other",null,null,null,null,13315000,13315000,13315000,{"$f":"3875000+5000254.91","v":8875254.9100000001},{"$f":"5476747+3126100.46","v":8602847.4600000009},{"$f":"7779231+1773499.58","v":9552730.5800000001}]
[]
["Agricultural assets",null,{"$f":"SUM(C66:C67)","v":0},{"$f":"SUM(D66:D67)","v":0},0,0,0,0,0,0,0]
["List sub-class"]
[]
[]
["Biological assets",null,{"$f":"SUM(C70:C71)","v":0},{"$f":"SUM(D70:D71)","v":0},0,0,0,0,0,0,0]
["List sub-class"]
[]
[]
["Intangibles",null,{"$f":"SUM(C74:C75)","v":0},{"$f":"SUM(D74:D75)","v":0},0,0,0,0,40000,42440,45028.84]
["Computers - software & programming",null,null,null,null,null,null,null,40000,42440,45028.84]
["Other (list sub-class)"]
[]
["Total Repairs and Maintenance Expenditure",1,{"$f":"C6+C27+C43+C47+C51+C73+C65+C69","v":11206908},32876183,0,13885000,{"$f":"G6+G27+G43+G47+G51+G73+G65+G69","v":13885000},13885000,18240509.91,20718382.460000001,23950789.120000001]
[]
["Specialised vehicles",null,{"$f":"SUM(C80:C83)","v":0},0,0,0,0,0,0,0,0]
["Refuse"]
["Fire"]
["Conservancy"]
["Ambulances"]
[]
["R&M as a % of PPE",null,{"$f":"IF(ISERROR(ROUND(C77/'A6-FinPos'!C19,3)),0,(ROUND(C77/'A6-FinPos'!C19,3)))","v":0.01},{"$f":"IF(ISERROR(ROUND(D77/'A6-FinPos'!D19,3)),0,(ROUND(D77/'A6-FinPos'!D19,3)))","v":4.7E-2},{"$f":"IF(ISERROR(ROUND(E77/'A6-FinPos'!E19,3)),0,(ROUND(E77/'A6-FinPos'!E19,3)))","v":0},{"$f":"IF(ISERROR(ROUND(F77/'A6-FinPos'!F19,3)),0,(ROUND(F77/'A6-FinPos'!F19,3)))","v":1.2999999999999999E-2},{"$f":"IF(ISERROR(ROUND(G77/'A6-FinPos'!G19,3)),0,(ROUND(G77/'A6-FinPos'!G19,3)))","v":1.2999999999999999E-2},{"$f":"IF(ISERROR(ROUND(H77/'A6-FinPos'!H19,3)),0,(ROUND(H77/'A6-FinPos'!H19,3)))","v":1.2999999999999999E-2},{"$f":"IF(ISERROR(ROUND(I77/'A6-FinPos'!J19,3)),0,(ROUND(I77/'A6-FinPos'!J19,3)))","v":1.7000000000000001E-2},{"$f":"IF(ISERROR(ROUND(J77/'A6-FinPos'!K19,3)),0,(ROUND(J77/'A6-FinPos'!K19,3)))","v":0.02},{"$f":"IF(ISERROR(ROUND(K77/'A6-FinPos'!L19,3)),0,(ROUND(K77/'A6-FinPos'!L19,3)))","v":2.3E-2}]
["R&M as % Operating Expenditure",null,{"$f":"IF(ISERROR(ROUND(C77/'A1-Sum'!B18,3)),0,(ROUND(C77/'A1-Sum'!B18,3)))","v":3.3000000000000002E-2},{"$f":"IF(ISERROR(ROUND(D77/'A1-Sum'!C18,3)),0,(ROUND(D77/'A1-Sum'!C18,3)))","v":0.124},{"$f":"IF(ISERROR(ROUND(E77/'A1-Sum'!D18,3)),0,(ROUND(E77/'A1-Sum'!D18,3)))","v":0},{"$f":"IF(ISERROR(ROUND(F77/'A1-Sum'!E18,3)),0,(ROUND(F77/'A1-Sum'!E18,3)))","v":7.4999999999999997E-2},{"$f":"IF(ISERROR(ROUND(G77/'A1-Sum'!F18,3)),0,(ROUND(G77/'A1-Sum'!F18,3)))","v":7.2999999999999995E-2},{"$f":"IF(ISERROR(ROUND(H77/'A1-Sum'!G18,3)),0,(ROUND(H77/'A1-Sum'!G18,3)))","v":7.4999999999999997E-2},{"$f":"IF(ISERROR(ROUND(I77/'A1-Sum'!I18,3)),0,(ROUND(I77/'A1-Sum'!I18,3)))","v":8.5000000000000006E-2},{"$f":"IF(ISERROR(ROUND(J77/'A1-Sum'!J18,3)),0,(ROUND(J77/'A1-Sum'!J18,3)))","v":9.2999999999999999E-2},{"$f":"IF(ISERROR(ROUND(K77/'A1-Sum'!K18,3)),0,(ROUND(K77/'A1-Sum'!K18,3)))","v":0.10199999999999999}]
[{"$f":"head27a","v":"References"}]
["1. Total Repairs and Maintenance Expenditure by Asset Category must reconcile to total repairs and maintenance expenditure on Table SA1"]
["2. Airports, Car Parks, Bus Terminals and Taxi Ranks"]
["3. For example - technology backbones (e.g. fibre optic, WIFI infrastructure) for economic development purposes"]
["4. Work-in-progress/under construction to be budgeted under the respective item"]
["5. Infrastructure includes 'land and buildings required' by that infrastructure and vehicles/plant & equipment used by the service generated by that infrastructure"]
["6. Donated/contributed & leased assets to be included within the respective sub-class"]
["7. Busses used to provide a service to the community"]
["8. Not municipal contributions to the 'top structure' being built using the housing subsidies"]
["9. Statues, art collections, medals etc."]
["10. Ambulances, fire engines, refuse vehicles - but not vehicles that would normally be classified as 'Plant and equipment'"]
[]
[]
["check balance",null,{"$f":"C77-'SA1'!C164","v":11206908},{"$f":"D77-'SA1'!D164","v":-454},{"$f":"E77-'SA1'!E164","v":-24254521},{"$f":"F77-'SA1'!F164","v":0},{"$f":"G77-'SA1'!G164","v":-6387500},{"$f":"H77-'SA1'!H164","v":13885000},{"$f":"I77-'SA1'!J164","v":255},{"$f":"J77-'SA1'!K164","v":282.00049000233412},{"$f":"K77-'SA1'!L164","v":289.53745988756418}]

{"sheet":"SA34d","index":57,"n_rows":97,"n_cols":11,"rows_kept":97,"cut":false,"hidden":false,"merged":[[1,5,1,7],[1,8,1,10]]}
[{"$f":"muni&\" - \"&TableA34d","v":"FS205 Mafube - Supporting Table SA34d Depreciation by asset class"}]
[{"$f":"desc","v":"Description"},{"$f":"head27","v":"Ref"},{"$f":"head1b","v":"2013/14"},{"$f":"head1A","v":"2014/15"},{"$f":"Head1","v":"2015/16"},{"$f":"Head2","v":"Current Year 2016/17"},null,null,{"$f":"Head3","v":"2017/18 Medium Term Revenue & Expenditure Framework"}]
["R thousand",1,{"$f":"Head5","v":"Audited Outcome"},{"$f":"Head5","v":"Audited Outcome"},{"$f":"Head5","v":"Audited Outcome"},{"$f":"Head6","v":"Original Budget"},{"$f":"Head7","v":"Adjusted Budget"},{"$f":"Head8","v":"Full Year Forecast"},{"$f":"Head9","v":"Budget Year 2017/18"},{"$f":"Head10","v":"Budget Year +1 2018/19"},{"$f":"Head11","v":"Budget Year +2 2019/20"}]
["Depreciation by Asset Class/Sub-class"]
[]
["Infrastructure",null,{"$f":"C7+C10+C14+C18+C21","v":-116979031},{"$f":"D7+D10+D14+D18+D21","v":-28498206},0,-1500000,-1500000,-1500000,0,0,0]
["Infrastructure - Road transport",null,{"$f":"SUM(C8:C9)","v":0},{"$f":"SUM(D8:D9)","v":0},0,0,0,0,0,0,0]
["Roads, Pavements & Bridges"]
["Storm water"]
["Infrastructure - Electricity",null,{"$f":"SUM(C11:C13)","v":0},{"$f":"SUM(D11:D13)","v":0},0,0,0,0,0,0,0]
["Generation"]
["Transmission & Reticulation"]
["Street Lighting"]
["Infrastructure - Water",null,{"$f":"SUM(C15:C17)","v":0},{"$f":"SUM(D15:D17)","v":0},0,0,0,0,0,0,0]
["Dams & Reservoirs"]
["Water purification"]
["Reticulation"]
["Infrastructure - Sanitation",null,{"$f":"SUM(C19:C20)","v":0},0,0,0,0,0,0,0,0]
["Reticulation"]
["Sewerage purification"]
["Infrastructure - Other",null,{"$f":"SUM(C22:C25)","v":-116979031},{"$f":"SUM(D22:D25)","v":-28498206},0,-1500000,-1500000,-1500000,0,0,0]
["Waste Management"]
["Transportation",2]
["Gas"]
["Other",3,-116979031,-28498206,0,-1500000,-1500000,-1500000]
[]
["Community",null,{"$f":"SUM(C28:C41)","v":-2622440},{"$f":"SUM(D28:D41)","v":-679083},0,0,0,0,0,0,0]
["Parks & gardens"]
["Sportsfields & stadia"]
["Swimming pools"]
["Community halls"]
["Libraries"]
["Recreational facilities"]
["Fire, safety & emergency"]
["Security and policing"]
["Buses",7]
["Clinics"]
["Museums & Art Galleries"]
["Cemeteries"]
["Social rental housing",8]
["Other",null,-2622440,-679083]
[]
["Heritage assets",null,{"$f":"SUM(C44:C45)","v":0},{"$f":"SUM(D44:D45)","v":0},0,0,0,0,0,0,0]
["Buildings"]
["Other",9]
[]
["Investment properties",null,{"$f":"SUM(C48:C49)","v":-1054780},{"$f":"SUM(D48:D49)","v":0},0,0,0,0,0,0,0]
["Housing development"]
["Other",null,-1054780]
[]
["Other assets",null,{"$f":"SUM(C52:C63)","v":-15669111},{"$f":"SUM(D52:D63)","v":-7373429},0,0,0,0,38259177,38259177,38259177]
["General vehicles",null,-2383084,-2353489]
["Specialised vehicles",10,{"$f":"C79","v":0},{"$f":"D79","v":0},0,0,0,0,0,0,0]
["Plant & equipment",null,null,-279992]
["Computers - hardware/equipment",null,null,-613465]
["Furniture and other office equipment"]
["Abattoirs"]
["Markets"]
["Civic Land and Buildings",null,null,-67437]
["Other Buildings",null,-13286027,-4059046]
["Other Land"]
["Surplus Assets - (Investment or Inventory)"]
["Other",null,null,null,null,null,null,null,38259177,38259177,38259177]
[]
["Agricultural assets",null,{"$f":"SUM(C66:C67)","v":0},{"$f":"SUM(D66:D67)","v":0},0,0,0,0,0,0,0]
["List sub-class"]
[]
[]
["Biological assets",null,{"$f":"SUM(C70:C71)","v":0},{"$f":"SUM(D70:D71)","v":0},0,0,0,0,0,0,0]
["List sub-class"]
[]
[]
["Intangibles",null,{"$f":"SUM(C74:C75)","v":0},{"$f":"SUM(D74:D75)","v":0},0,0,0,0,0,0,0]
["Computers - software & programming"]
["Other (list sub-class)"]
[]
["Total Depreciation",1,{"$f":"C6+C27+C43+C47+C51+C73+C65+C69","v":-136325362},-36550718,0,-1500000,{"$f":"G6+G27+G43+G47+G51+G73+G65+G69","v":-1500000},-1500000,38259177,38259177,38259177]
[]
["Specialised vehicles",null,{"$f":"SUM(C80:C83)","v":0},0,0,0,0,0,0,0,0]
["Refuse"]
["Fire"]
["Conservancy"]
["Ambulances"]
[{"$f":"head27a","v":"References"}]
["1. Depreciation based on write down values. Not including Depreciation resulting from revaluation."]
["2. Airports, Car Parks, Bus Terminals and Taxi Ranks"]
["3. For example - technology backbones (e.g. fibre optic, WIFI infrastructure) for economic development purposes"]
["4. Work-in-progress/under construction to be budgeted under the respective item"]
["5. Infrastructure includes 'land and buildings required' by that infrastructure and vehicles/plant & equipment used by the service generated by that infrastructure"]
["6. Donated/contributed & leased assets to be included within the respective sub-class"]
["7. Busses used to provide a service to the community"]
["8. Not municipal contributions to the 'top structure' being built using the housing subsidies"]
["9. Statues, art collections, medals etc."]
["10. Ambulances, fire engines, refuse vehicles - but not vehicles that would normally be classified as 'Plant and equipment'"]
[]
[]
["Check",null,{"$f":"C77-'A4-FinPerf RE'!C28","v":-273608709},{"$f":"D77-'A4-FinPerf RE'!D28","v":-73837081},{"$f":"E77-'A4-FinPerf RE'!E28","v":-38259177},{"$f":"F77-'A4-FinPerf RE'!F28","v":-3000000},{"$f":"G77-'A4-FinPerf RE'!G28","v":-3000000},{"$f":"H77-'A4-FinPerf RE'!H28","v":-3000000},{"$f":"I77-'A4-FinPerf RE'!J28","v":0},{"$f":"J77-'A4-FinPerf RE'!K28","v":0},{"$f":"K77-'A4-FinPerf RE'!L28","v":0}]

{"sheet":"SA35","index":58,"n_rows":60,"n_cols":9,"rows_kept":60,"cut":false,"hidden":false,"merged":[[1,5,1,8],[1,2,1,4]]}
[{"$f":"muni&\" - \"&TableA35","v":"FS205 Mafube - Supporting Table SA35 Future financial implications of the capital budget"}]
[{"$f":"Vdesc","v":"Vote Description"},{"$f":"head27","v":"Ref"},{"$f":"Head3","v":"2017/18 Medium Term Revenue & Expenditure Framework"},null,null,"Forecasts"]
["R thousand",null,{"$f":"Head9","v":"Budget Year 2017/18"},{"$f":"Head10","v":"Budget Year +1 2018/19"},{"$f":"Head11","v":"Budget Year +2 2019/20"},{"$f":"Head12","v":"Forecast 2020/21"},{"$f":"Head13","v":"Forecast 2021/22"},{"$f":"Head14","v":"Forecast 2022/23"},{"$f":"Head48","v":"Present value"}]
["Capital expenditure",1]
[{"$f":"'A5-Capex'!A6","v":"Vote 1 - OFFICE OF THE MAYOR"},null,{"$f":"'A5-Capex'!J6+'A5-Capex'!J24","v":0},{"$f":"'A5-Capex'!K6+'A5-Capex'!K24","v":0},{"$f":"'A5-Capex'!L6+'A5-Capex'!L24","v":0}]
[{"$f":"'A5-Capex'!A7","v":"Vote 2 - OFFICE OF THE SPEAKER"},null,{"$f":"'A5-Capex'!J7+'A5-Capex'!J25","v":0},{"$f":"'A5-Capex'!K7+'A5-Capex'!K25","v":0},{"$f":"'A5-Capex'!L7+'A5-Capex'!L25","v":0}]
[{"$f":"'A5-Capex'!A8","v":"Vote 3 - OFFICE OF THE MUNICIPAL MANAGER"},null,{"$f":"'A5-Capex'!J8+'A5-Capex'!J26","v":2000000},{"$f":"'A5-Capex'!K8+'A5-Capex'!K26","v":2122000},{"$f":"'A5-Capex'!L8+'A5-Capex'!L26","v":2251442}]
[{"$f":"'A5-Capex'!A9","v":"Vote 4 - COMMUNITY SERVICES"},null,{"$f":"'A5-Capex'!J9+'A5-Capex'!J27","v":7224070.7199999997},{"$f":"'A5-Capex'!K9+'A5-Capex'!K27","v":1074330},{"$f":"'A5-Capex'!L9+'A5-Capex'!L27","v":1126665}]
[{"$f":"'A5-Capex'!A10","v":"Vote 5 - CORPORATE SERVICES"},null,{"$f":"'A5-Capex'!J10+'A5-Capex'!J28","v":0},{"$f":"'A5-Capex'!K10+'A5-Capex'!K28","v":0},{"$f":"'A5-Capex'!L10+'A5-Capex'!L28","v":0}]
[{"$f":"'A5-Capex'!A11","v":"Vote 6 - FINANCIAL SERVICES"},null,{"$f":"'A5-Capex'!J11+'A5-Capex'!J29","v":0},{"$f":"'A5-Capex'!K11+'A5-Capex'!K29","v":0},{"$f":"'A5-Capex'!L11+'A5-Capex'!L29","v":0}]
[{"$f":"'A5-Capex'!A12","v":"Vote 7 - INFRASTRUCTURE SERVICES"},null,{"$f":"'A5-Capex'!J12+'A5-Capex'!J30","v":23867842.037599999},{"$f":"'A5-Capex'!K12+'A5-Capex'!K30","v":28799661.885175999},{"$f":"'A5-Capex'!L12+'A5-Capex'!L30","v":34898162.364027761}]
[{"$f":"'A5-Capex'!A13","v":"Vote 8 - SERVICE DELIVERY AND PUBLIC SAFETY"},null,{"$f":"'A5-Capex'!J13+'A5-Capex'!J31","v":0},{"$f":"'A5-Capex'!K13+'A5-Capex'!K31","v":0},{"$f":"'A5-Capex'!L13+'A5-Capex'!L31","v":0}]
[{"$f":"'A5-Capex'!A14","v":"Vote 9 - [NAME OF VOTE 9]"},null,{"$f":"'A5-Capex'!J14+'A5-Capex'!J32","v":0},{"$f":"'A5-Capex'!K14+'A5-Capex'!K32","v":0},{"$f":"'A5-Capex'!L14+'A5-Capex'!L32","v":0}]
[{"$f":"'A5-Capex'!A15","v":"Vote 10 - [NAME OF VOTE 10]"},null,{"$f":"'A5-Capex'!J15+'A5-Capex'!J33","v":0},{"$f":"'A5-Capex'!K15+'A5-Capex'!K33","v":0},{"$f":"'A5-Capex'!L15+'A5-Capex'!L33","v":0}]
[{"$f":"'A5-Capex'!A16","v":"Vote 11 - [NAME OF VOTE 11]"},null,{"$f":"'A5-Capex'!J16+'A5-Capex'!J34","v":0},{"$f":"'A5-Capex'!K16+'A5-Capex'!K34","v":0},{"$f":"'A5-Capex'!L16+'A5-Capex'!L34","v":0}]
[{"$f":"'A5-Capex'!A17","v":"Vote 12 - [NAME OF VOTE 12]"},null,{"$f":"'A5-Capex'!J17+'A5-Capex'!J35","v":0},{"$f":"'A5-Capex'!K17+'A5-Capex'!K35","v":0},{"$f":"'A5-Capex'!L17+'A5-Capex'!L35","v":0}]
[{"$f":"'A5-Capex'!A18","v":"Vote 13 - [NAME OF VOTE 13]"},null,{"$f":"'A5-Capex'!J18+'A5-Capex'!J36","v":0},{"$f":"'A5-Capex'!K18+'A5-Capex'!K36","v":0},{"$f":"'A5-Capex'!L18+'A5-Capex'!L36","v":0}]
[{"$f":"'A5-Capex'!A19","v":"Vote 14 - [NAME OF VOTE 14]"},null,{"$f":"'A5-Capex'!J19+'A5-Capex'!J37","v":0},{"$f":"'A5-Capex'!K19+'A5-Capex'!K37","v":0},{"$f":"'A5-Capex'!L19+'A5-Capex'!L37","v":0}]
[{"$f":"'A5-Capex'!A20","v":"Vote 15 - [NAME OF VOTE 15]"},null,{"$f":"'A5-Capex'!J20+'A5-Capex'!J38","v":0},{"$f":"'A5-Capex'!K20+'A5-Capex'!K38","v":0},{"$f":"'A5-Capex'!L20+'A5-Capex'!L38","v":0}]
["List entity summary if applicable"]
["Total Capital Expenditure ",null,{"$f":"SUM(C5:C20)","v":33091912.757599998},{"$f":"SUM(D5:D20)","v":31995991.885175999},38276269.364027761,0,0,0,0]
[]
["Future operational costs by vote",2]
[{"$f":"A5","v":"Vote 1 - OFFICE OF THE MAYOR"}]
[{"$f":"A6","v":"Vote 2 - OFFICE OF THE SPEAKER"}]
["Vote 3 - OFFICE OF THE MUNICIPAL MANAGER"]
["Vote 4 - COMMUNITY SERVICES"]
["Vote 5 - CORPORATE SERVICES"]
["Vote 6 - FINANCIAL SERVICES"]
["Vote 7 - INFRASTRUCTURE SERVICES"]
["Vote 8 - SERVICE DELIVERY AND PUBLIC SAFETY"]
["Vote 9 - [NAME OF VOTE 9]"]
["Vote 10 - [NAME OF VOTE 10]"]
["Vote 11 - [NAME OF VOTE 11]"]
["Vote 12 - [NAME OF VOTE 12]"]
["Vote 13 - [NAME OF VOTE 13]"]
["Vote 14 - [NAME OF VOTE 14]"]
["Vote 15 - [NAME OF VOTE 15]"]
["List entity summary if applicable"]
["Total future operational costs",null,{"$f":"SUM(C24:C39)","v":0},{"$f":"SUM(D24:D39)","v":0},0,0,0,0,0]
[]
["Future revenue by source",3]
[{"$f":"'A4-FinPerf RE'!A5","v":"Property rates"}]
[{"$f":"'A4-FinPerf RE'!A6","v":"Property rates - penalties & collection charges"}]
[{"$f":"'A4-FinPerf RE'!A7","v":"Service charges - electricity revenue"}]
[{"$f":"'A4-FinPerf RE'!A8","v":"Service charges - water revenue"}]
[{"$f":"'A4-FinPerf RE'!A9","v":"Service charges - sanitation revenue"}]
[{"$f":"'A4-FinPerf RE'!A10","v":"Service charges - refuse revenue"}]
[{"$f":"'A4-FinPerf RE'!A11","v":"Service charges - other"}]
[{"$f":"'A4-FinPerf RE'!A12","v":"Rental of facilities and equipment"}]
["List other revenues sources if applicable"]
["List entity summary if applicable"]
["Total future revenue",null,{"$f":"SUM(C43:C52)","v":0},{"$f":"SUM(D43:D52)","v":0},0,0,0,0,0]
["Net Financial Implications",null,{"$f":"C21+C40-C53","v":33091912.757599998},31995991.885175999,38276269.364027761,0,0,0,0]
[{"$f":"head27a","v":"References"}]
["1. Summarise the total capital cost until capital project is operational (MFMA s19(2)(a))"]
["2. Summary of future operational costs from when projects operational (present value until the end of each asset's useful life) (MFMA s19(2)(b))"]
["3. Summarise the future revenue from when projects are operational, including municipal tax and tariff implications, (present value until the end of asset's useful life)"]
[]
["check",null,{"$f":"C21-('A5-Capex'!J21+'A5-Capex'!J39)","v":0},{"$f":"D21-('A5-Capex'!K21+'A5-Capex'!K39)","v":0},{"$f":"E21-('A5-Capex'!L21+'A5-Capex'!L39)","v":0}]

{"sheet":"SA36","index":59,"n_rows":44,"n_cols":17,"rows_kept":44,"cut":false,"hidden":false,"merged":[[1,15,1,16],[1,2,2,2],[1,3,2,3],[1,4,2,4],[1,10,1,11],[1,9,2,9],[1,12,1,14]]}
[{"$f":"muni&\" - \"&TableA36","v":"FS205 Mafube - Supporting Table SA36 Detailed capital budget"}]
["Municipal Vote/Capital project",{"$f":"head27","v":"Ref"},"Program/Project description","Project number","IDP Goal code \n2","Individually Approved\n(Yes/No)","Asset Class     \n","Asset Sub-Class   \n","GPS co-ordinates\n","Total Project Estimate","Prior year outcomes",null,{"$f":"Head3","v":"2017/18 Medium Term Revenue & Expenditure Framework"},null,null,"Project information"]
["R thousand",4,null,"Audited Actual",null,6,3,3,5,null,{"$f":"Head5&\"    \"&Head1","v":"Audited Outcome    2015/16"},{"$f":"Head2 & \"        \"&Head8","v":"Current Year 2016/17        Full Year Forecast"},{"$f":"Head9","v":"Budget Year 2017/18"},{"$f":"Head10","v":"Budget Year +1 2018/19"},{"$f":"Head11","v":"Budget Year +2 2019/20"},"Ward location","New or renewal"]
["Parent municipality:"]
["List all capital projects grouped by Municipal Vote"]
[]
["Communiy Services",null,"EPWP",null,null,null,"Non-revenue Generating","Other","Latitude=27°56089645 Longitude= 28°5179364 Latitude= 27°28654973 Longitude= 28°47759621 Latitude= 27°05344288  Longitude= 28°85185102 latitude= 27°2434657 Longitude= 28°85185102",null,null,60000,null,null,null,"All wards","Renewal"]
["Communiy Services",null,"Upgrade of Khatholoha",null,null,"Yes","Non-revenue Generating","Sportsfields & stadia","Latidude=27°15'32.40\"S Longitude= 28°30'25.67\"E",null,null,2192933.5,1993365.33,215400,0,"2,5,6 and 7","Renewal"]
["Infrastrucure Services",null,"Construction of a new water reservoir - Villiers",null,null,"Yes","Water Supply Infrastructure","Dams & Reservoirs","Latitude=27°02'34.13\"S Longitude=28°36'13.01\"E",null,null,0,757594.63,10193897.859999999,18580105,"3,4 and 9","New"]
["Infrastrucure Services",null,"Constructtion of waste water treatment plant - Villiers",null,null,"Yes","Sanitation Infrastructure","Waste Water Treatment Works",null,null,null,16945309,17509597.609999999,8293989.29,2622000]
["Communiy Services",null,"Upgrade of Villiers Sports Ground",null,null,"Yes","Non-revenue Generating","Abattoirs","Latitude=27°56089645 Longitude= 28°5179364 Latitude= 27°28654973 Longitude= 28°47759621 Latitude= 27°05344288  Longitude= 28°85185102 latitude= 27°2434657 Longitude= 28°85185102",null,null,1000000,null,null,null,"3, 4 and 9","Renewal"]
["Infrastrucure Services",null,"PMU",null,null,"Yes","Non-revenue Generating","Abattoirs","Latitude=27°56089645 Longitude= 28°5179364 Latitude= 27°28654973 Longitude= 28°47759621 Latitude= 27°05344288  Longitude= 28°85185102 latitude= 27°2434657 Longitude= 28°85185102",null,null,90735,365912.75760000001,193691.88517599995,239677.36402775999,"3, 4 and 9","Renewal"]
["Infrastrucure Services",null,"Namahadi Roads and stormwater drainage ",null,null,"Yes","Roads Infrastructure","Roads, Pavements & Bridges","Point A= 27°16'05.52\"S  28°30'09.13\" E,  Point B 27°15'47.99\"S  28°30'43.44\"E",null,null,0,0,0,0,"2,5,6 and 7","New"]
["Infrastrucure Services",null,"Electrification ",null,null,"Yes","Electrical Infrastructure","Transmission & Reticulation","Latitude=27°14'38.61\"S Longitude=28°30'53.19\"E",null,null,11000000,5000000,7000000,12000000,7,"New"]
["Infrastrucure Services",null,"Frankfort water reticulation",null,null,"Yes","Water Supply Infrastructure","Water purification","Latitude=27°14'38.61\"S Longitude=28°30'53.19\"E",null,null,234737.04,234737.04,160000,0,"2,5,6 and 7","New"]
["Corporate, Finance, Municipal Manager and Community Services",null,"Other Assets: Equipment, Vehicles etc",null,null,"Yes","Operational Buildings","Other","Latitude=27°56089645 Longitude= 28°5179364 Latitude= 27°28654973 Longitude= 28°47759621 Latitude= 27°05344288  Longitude= 28°85185102 latitude= 27°2434657 Longitude= 28°85185102",null,null,9610000.4600000009,2000000,2122000,2251442,"All wards","New"]
["Communiy Services",null,"Upgrade of Mafahlaneng Sports Stadium",null,null,"Yes","Non-revenue Generating","Outdoor Facilities",null,null,null,977920,806190.39,106000,0]
["Infrastrucure Services",null,"Construction of extension of water - Villiers",null,null,"Yes","Water Supply Infrastructure","Water Treatment Works",null,null,null,0,0,0,0]
["Infrastrucure Services",null,"Mafahlaneng - Roads and stormwater drainage",null,null,"Yes","Roads Infrastructure","Roads",null,null,null,0,0,0,0]
[null,null,"Namahadi - Phomolong roads and stormwater drainage",null,null,"Yes","Roads Infrastructure","Roads",null,null,null,0,0,2958082.85,1456380]
["Communiy Services",null,"Upgrade of Ntswanatsatsi Sports Ground",null,null,"Yes","Sport and Recreation Facilities","Outdoor Facilities",null,null,null,0,4424515,200000,0]
["Communiy Services",null,"Upgrade of Zomba Sports Ground",null,null,"Yes","Sport and Recreation Facilities","Outdoor Facilities",null,null,null,0,0,552930,1126665]
["Parent Capital expenditure",1,null,null,null,null,null,null,null,null,null,{"$f":"SUM(L7:L22)","v":42111635},{"$f":"SUM(M7:M22)","v":33091912.757599998},{"$f":"SUM(N7:N22)","v":31995991.885175999},{"$f":"SUM(O7:O22)","v":38276269.364027761}]
[]
["Entities:"]
["List all capital projects grouped by Entity"]
[]
["Entity A"]
["Water project A"]
[]
["Entity B"]
["Electricity project B"]
[]
[]
[]
["Entity Capital expenditure",null,null,null,null,null,null,null,null,null,{"$f":"SUM(K28:K35)","v":0},{"$f":"SUM(L28:L35)","v":0},{"$f":"SUM(M28:M35)","v":0},{"$f":"SUM(N28:N35)","v":0},{"$f":"SUM(O28:O35)","v":0}]
["Total Capital expenditure",null,null,null,null,null,null,null,null,null,{"$f":"SUM(K7:K22)+SUM(K28:K35)","v":0},{"$f":"SUM(L7:L22)+SUM(L28:L35)","v":42111635},{"$f":"SUM(M7:M22)+SUM(M28:M35)","v":33091912.757599998},{"$f":"SUM(N7:N22)+SUM(N28:N35)","v":31995991.885175999},{"$f":"SUM(O7:O22)+SUM(O28:O35)","v":38276269.364027761}]
[{"$f":"head27a","v":"References"}]
["1. Must reconcile with Budgeted Capital Expenditure"]
["2. As per Table SA6"]
["3. As per Table SA34"]
["4. Projects that fall above the threshold values applicable to the municipality as identified in regulation 13 of the Municipal Budget and Reporting Regulations must be listed individually. Other projects by programme by Vote"]
["5. Correct to seconds. Provide a logical starting point on networked infrastructure."]
["6. Distinguish projects approved in terms of MFMA section 19(1)(b) and MRRR Regulation 13",null,null,null,null,null,null,null,null,"Check",{"$f":"SUM(SA34a!E77+SA34b!E77)-'SA36'!K37","v":9031915}]

{"sheet":"SA37","index":60,"n_rows":28,"n_cols":13,"rows_kept":28,"cut":false,"hidden":false,"merged":[[1,0,2,0],[1,7,2,7],[1,8,1,9],[1,10,1,12],[1,2,3,2],[1,3,3,3],[1,5,3,5],[1,4,3,4],[1,6,3,6]]}
[{"$f":"muni&\" - \"&TableA37","v":"FS205 Mafube - Supporting Table SA37 Projects delayed from previous financial year/s"}]
["Municipal Vote/Capital project","Ref.","Project name","Project number","Asset Class  \n3","Asset Sub-Class  \n3","GPS co-ordinates\n4",{"$f":"Head47","v":"Previous target year to complete"},{"$f":"Head2","v":"Current Year 2016/17"},null,{"$f":"Head3","v":"2017/18 Medium Term Revenue & Expenditure Framework"}]
[null,"1,2",null,"Audited Actual",null,null,null,null,{"$f":"Head6","v":"Original Budget"},{"$f":"Head8","v":"Full Year Forecast"},{"$f":"Head9","v":"Budget Year 2017/18"},{"$f":"Head10","v":"Budget Year +1 2018/19"},{"$f":"Head11","v":"Budget Year +2 2019/20"}]
["R thousand",null,null,"R'000",null,null,null,"Year"]
["Parent municipality:"]
["List all capital projects grouped by Municipal Vote",null,null,null,"Examples","Examples"]
[]
[]
[]
[]
[]
[]
[]
[]
["Entities:"]
["List all capital projects grouped by Municipal Entity"]
[]
["Entity Name"]
["Project name"]
[]
[]
[]
[]
[{"$f":"head27a","v":"References"}]
["1. List all projects with planned completion dates in current year that have been re-budgeted in the MTREF"]
["2. Refer MFMA s30"]
["3. As per Table SA34"]
["4. Correct to seconds. Provide a logical starting point on networked infrastructure."]